[VOTE] Release Apache NiFi 1.3.0

classic Classic list List threaded Threaded
29 messages Options
12
Reply | Threaded
Open this post in threaded view
|

[VOTE] Release Apache NiFi 1.3.0

Matt Gilman-2
Hello,


I am pleased to be calling this vote for the source release of Apache NiFi
nifi-1.3.0.


The source zip, including signatures, digests, etc. can be found at:

https://repository.apache.org/content/repositories/orgapachenifi-1108


The Git tag is nifi-1.3.0-RC1

The Git commit ID is ddb73612bd1512d8b2151b81f9aa40811bca2aaa

https://git-wip-us.apache.org/repos/asf?p=nifi.git;a=commit;h=ddb73612bd1512d8b2151b81f9aa40811bca2aaa


Checksums of nifi-1.3.0-source-release.zip:

MD5: 8b115682ac392342b9edff3bf0658ecb

SHA1: f11cdebbabdc0d8f1f0dd4c5b880ded39d17f234

SHA256: 9ba5565729d98c472c31a1fdbc44e9dc1eee87a2cf5184e8428743f753145b7f


Release artifacts are signed with the following key:

https://people.apache.org/keys/committer/mcgilman.asc


KEYS file available here:

https://dist.apache.org/repos/dist/release/nifi/KEYS


110 issues were closed/resolved for this release:

https://issues.apache.org/jira/secure/ReleaseNote.jspa?projectId=12316020&version=12340498


Release note highlights can be found here:

https://cwiki.apache.org/confluence/display/NIFI/Release+Notes#ReleaseNotes-Version1.3.0


The vote will be open for 72 hours.

Please download the release candidate and evaluate the necessary items
including checking hashes, signatures, build from source, and test.  The
please vote:


[ ] +1 Release this package as nifi-1.3.0

[ ] +0 no opinion

[ ] -1 Do not release this package because...
Reply | Threaded
Open this post in threaded view
|

Re: [VOTE] Release Apache NiFi 1.3.0

Adam Taft
I'm getting a test failure for this RC.  Here is the maven snippet.

-------------------------------------------------------
 T E S T S
-------------------------------------------------------
Running org.apache.nifi.provenance.CryptoUtilsTest
Tests run: 16, Failures: 1, Errors: 0, Skipped: 0, Time elapsed: 0.761 sec
<<< FAILURE! - in org.apache.nifi.provenance.CryptoUtilsTest
testShouldNotValidateUnreadableFileBasedKeyProvider(org.apache.nifi.provenance.CryptoUtilsTest)
Time elapsed: 0.052 sec  <<< FAILURE!
org.codehaus.groovy.runtime.powerassert.PowerAssertionError: assert
!unreadableKeyProviderIsValid
       ||
       |true
       false
    at
org.codehaus.groovy.runtime.InvokerHelper.assertFailed(InvokerHelper.java:402)
    at
org.codehaus.groovy.runtime.ScriptBytecodeAdapter.assertFailed(ScriptBytecodeAdapter.java:650)
    at
org.apache.nifi.provenance.CryptoUtilsTest.testShouldNotValidateUnreadableFileBasedKeyProvider(CryptoUtilsTest.groovy:214)
Results :
Failed tests:
  CryptoUtilsTest.testShouldNotValidateUnreadableFileBasedKeyProvider:214
assert !unreadableKeyProviderIsValid
       ||
       |true
       false

I'm running from a clean docker container from centos:latest.  I installed
openjdk-1.8.0-devel and maven 3.5.0 into the container.  The openjdk comes
with the crypto extensions, so I don't think this is the problem.

Any thoughts on the above?

By the way, the signatures and hashes look good.  However I don't see a
1.3.0-RC1 tag, as per your email.

Thanks,

Adam

p.s. here's more environment info:

[root@0e3de1bf9bfc nifi-1.3.0]# mvn --version
Apache Maven 3.5.0 (ff8f5e7444045639af65f6095c62210b5713f426;
2017-04-03T19:39:06Z)
Maven home: /opt/apache-maven-3.5.0
Java version: 1.8.0_131, vendor: Oracle Corporation
Java home: /usr/lib/jvm/java-1.8.0-openjdk-1.8.0.131-3.b12.el7_3.x86_64/jre
Default locale: en_US, platform encoding: ANSI_X3.4-1968
OS name: "linux", version: "4.9.27-moby", arch: "amd64", family: "unix"
[root@0e3de1bf9bfc nifi-1.3.0]# uname -a
Linux 0e3de1bf9bfc 4.9.27-moby #1 SMP Thu May 11 04:01:18 UTC 2017 x86_64
x86_64 x86_64 GNU/Linux
[root@0e3de1bf9bfc nifi-1.3.0]# cat /etc/redhat-release
CentOS Linux release 7.3.1611 (Core)




On Mon, Jun 5, 2017 at 11:54 AM, Matt Gilman <[hidden email]> wrote:

> Hello,
>
>
> I am pleased to be calling this vote for the source release of Apache NiFi
> nifi-1.3.0.
>
>
> The source zip, including signatures, digests, etc. can be found at:
>
> https://repository.apache.org/content/repositories/orgapachenifi-1108
>
>
> The Git tag is nifi-1.3.0-RC1
>
> The Git commit ID is ddb73612bd1512d8b2151b81f9aa40811bca2aaa
>
> https://git-wip-us.apache.org/repos/asf?p=nifi.git;a=commit;h=
> ddb73612bd1512d8b2151b81f9aa40811bca2aaa
>
>
> Checksums of nifi-1.3.0-source-release.zip:
>
> MD5: 8b115682ac392342b9edff3bf0658ecb
>
> SHA1: f11cdebbabdc0d8f1f0dd4c5b880ded39d17f234
>
> SHA256: 9ba5565729d98c472c31a1fdbc44e9dc1eee87a2cf5184e8428743f753145b7f
>
>
> Release artifacts are signed with the following key:
>
> https://people.apache.org/keys/committer/mcgilman.asc
>
>
> KEYS file available here:
>
> https://dist.apache.org/repos/dist/release/nifi/KEYS
>
>
> 110 issues were closed/resolved for this release:
>
> https://issues.apache.org/jira/secure/ReleaseNote.jspa?
> projectId=12316020&version=12340498
>
>
> Release note highlights can be found here:
>
> https://cwiki.apache.org/confluence/display/NIFI/
> Release+Notes#ReleaseNotes-Version1.3.0
>
>
> The vote will be open for 72 hours.
>
> Please download the release candidate and evaluate the necessary items
> including checking hashes, signatures, build from source, and test.  The
> please vote:
>
>
> [ ] +1 Release this package as nifi-1.3.0
>
> [ ] +0 no opinion
>
> [ ] -1 Do not release this package because...
>
Reply | Threaded
Open this post in threaded view
|

Re: [VOTE] Release Apache NiFi 1.3.0

Matt Gilman
Adam,

Thanks for the heads up on the missing tag. When I pushed up the release
branch I had forgotten to include the tags. It should be there now. Sorry
about that.

I did not have any trouble with the test you specified. Is it sporadic or
does it fail every time? That test appears unchanged since 1.2.0. Did you
have trouble with that release in this environment too?

Thanks!

Matt

On Mon, Jun 5, 2017 at 5:25 PM, Adam Taft <[hidden email]> wrote:

> I'm getting a test failure for this RC.  Here is the maven snippet.
>
> -------------------------------------------------------
>  T E S T S
> -------------------------------------------------------
> Running org.apache.nifi.provenance.CryptoUtilsTest
> Tests run: 16, Failures: 1, Errors: 0, Skipped: 0, Time elapsed: 0.761 sec
> <<< FAILURE! - in org.apache.nifi.provenance.CryptoUtilsTest
> testShouldNotValidateUnreadableFileBasedKeyProvider(org.
> apache.nifi.provenance.CryptoUtilsTest)
> Time elapsed: 0.052 sec  <<< FAILURE!
> org.codehaus.groovy.runtime.powerassert.PowerAssertionError: assert
> !unreadableKeyProviderIsValid
>        ||
>        |true
>        false
>     at
> org.codehaus.groovy.runtime.InvokerHelper.assertFailed(
> InvokerHelper.java:402)
>     at
> org.codehaus.groovy.runtime.ScriptBytecodeAdapter.assertFailed(
> ScriptBytecodeAdapter.java:650)
>     at
> org.apache.nifi.provenance.CryptoUtilsTest.testShouldNotValidateUnreadabl
> eFileBasedKeyProvider(CryptoUtilsTest.groovy:214)
> Results :
> Failed tests:
>   CryptoUtilsTest.testShouldNotValidateUnreadableFileBasedKeyProvider:214
> assert !unreadableKeyProviderIsValid
>        ||
>        |true
>        false
>
> I'm running from a clean docker container from centos:latest.  I installed
> openjdk-1.8.0-devel and maven 3.5.0 into the container.  The openjdk comes
> with the crypto extensions, so I don't think this is the problem.
>
> Any thoughts on the above?
>
> By the way, the signatures and hashes look good.  However I don't see a
> 1.3.0-RC1 tag, as per your email.
>
> Thanks,
>
> Adam
>
> p.s. here's more environment info:
>
> [root@0e3de1bf9bfc nifi-1.3.0]# mvn --version
> Apache Maven 3.5.0 (ff8f5e7444045639af65f6095c62210b5713f426;
> 2017-04-03T19:39:06Z)
> Maven home: /opt/apache-maven-3.5.0
> Java version: 1.8.0_131, vendor: Oracle Corporation
> Java home: /usr/lib/jvm/java-1.8.0-openjdk-1.8.0.131-3.b12.el7_3.
> x86_64/jre
> Default locale: en_US, platform encoding: ANSI_X3.4-1968
> OS name: "linux", version: "4.9.27-moby", arch: "amd64", family: "unix"
> [root@0e3de1bf9bfc nifi-1.3.0]# uname -a
> Linux 0e3de1bf9bfc 4.9.27-moby #1 SMP Thu May 11 04:01:18 UTC 2017 x86_64
> x86_64 x86_64 GNU/Linux
> [root@0e3de1bf9bfc nifi-1.3.0]# cat /etc/redhat-release
> CentOS Linux release 7.3.1611 (Core)
>
>
>
>
> On Mon, Jun 5, 2017 at 11:54 AM, Matt Gilman <[hidden email]> wrote:
>
> > Hello,
> >
> >
> > I am pleased to be calling this vote for the source release of Apache
> NiFi
> > nifi-1.3.0.
> >
> >
> > The source zip, including signatures, digests, etc. can be found at:
> >
> > https://repository.apache.org/content/repositories/orgapachenifi-1108
> >
> >
> > The Git tag is nifi-1.3.0-RC1
> >
> > The Git commit ID is ddb73612bd1512d8b2151b81f9aa40811bca2aaa
> >
> > https://git-wip-us.apache.org/repos/asf?p=nifi.git;a=commit;h=
> > ddb73612bd1512d8b2151b81f9aa40811bca2aaa
> >
> >
> > Checksums of nifi-1.3.0-source-release.zip:
> >
> > MD5: 8b115682ac392342b9edff3bf0658ecb
> >
> > SHA1: f11cdebbabdc0d8f1f0dd4c5b880ded39d17f234
> >
> > SHA256: 9ba5565729d98c472c31a1fdbc44e9dc1eee87a2cf5184e8428743f753145b7f
> >
> >
> > Release artifacts are signed with the following key:
> >
> > https://people.apache.org/keys/committer/mcgilman.asc
> >
> >
> > KEYS file available here:
> >
> > https://dist.apache.org/repos/dist/release/nifi/KEYS
> >
> >
> > 110 issues were closed/resolved for this release:
> >
> > https://issues.apache.org/jira/secure/ReleaseNote.jspa?
> > projectId=12316020&version=12340498
> >
> >
> > Release note highlights can be found here:
> >
> > https://cwiki.apache.org/confluence/display/NIFI/
> > Release+Notes#ReleaseNotes-Version1.3.0
> >
> >
> > The vote will be open for 72 hours.
> >
> > Please download the release candidate and evaluate the necessary items
> > including checking hashes, signatures, build from source, and test.  The
> > please vote:
> >
> >
> > [ ] +1 Release this package as nifi-1.3.0
> >
> > [ ] +0 no opinion
> >
> > [ ] -1 Do not release this package because...
> >
>
Reply | Threaded
Open this post in threaded view
|

Re: [VOTE] Release Apache NiFi 1.3.0

Joey Frazee
In reply to this post by Adam Taft
Adam, this can happen if you're building as root (E.g., if you're being lazy like me and just using a disposable Docker container).

NIFI-3836 is open for it.

If this is what it is, just build as a non root user.

> On Jun 5, 2017, at 5:25 PM, Adam Taft <[hidden email]> wrote:
>
> I'm getting a test failure for this RC.  Here is the maven snippet.
>
> -------------------------------------------------------
> T E S T S
> -------------------------------------------------------
> Running org.apache.nifi.provenance.CryptoUtilsTest
> Tests run: 16, Failures: 1, Errors: 0, Skipped: 0, Time elapsed: 0.761 sec
> <<< FAILURE! - in org.apache.nifi.provenance.CryptoUtilsTest
> testShouldNotValidateUnreadableFileBasedKeyProvider(org.apache.nifi.provenance.CryptoUtilsTest)
> Time elapsed: 0.052 sec  <<< FAILURE!
> org.codehaus.groovy.runtime.powerassert.PowerAssertionError: assert
> !unreadableKeyProviderIsValid
>       ||
>       |true
>       false
>    at
> org.codehaus.groovy.runtime.InvokerHelper.assertFailed(InvokerHelper.java:402)
>    at
> org.codehaus.groovy.runtime.ScriptBytecodeAdapter.assertFailed(ScriptBytecodeAdapter.java:650)
>    at
> org.apache.nifi.provenance.CryptoUtilsTest.testShouldNotValidateUnreadableFileBasedKeyProvider(CryptoUtilsTest.groovy:214)
> Results :
> Failed tests:
>  CryptoUtilsTest.testShouldNotValidateUnreadableFileBasedKeyProvider:214
> assert !unreadableKeyProviderIsValid
>       ||
>       |true
>       false
>
> I'm running from a clean docker container from centos:latest.  I installed
> openjdk-1.8.0-devel and maven 3.5.0 into the container.  The openjdk comes
> with the crypto extensions, so I don't think this is the problem.
>
> Any thoughts on the above?
>
> By the way, the signatures and hashes look good.  However I don't see a
> 1.3.0-RC1 tag, as per your email.
>
> Thanks,
>
> Adam
>
> p.s. here's more environment info:
>
> [root@0e3de1bf9bfc nifi-1.3.0]# mvn --version
> Apache Maven 3.5.0 (ff8f5e7444045639af65f6095c62210b5713f426;
> 2017-04-03T19:39:06Z)
> Maven home: /opt/apache-maven-3.5.0
> Java version: 1.8.0_131, vendor: Oracle Corporation
> Java home: /usr/lib/jvm/java-1.8.0-openjdk-1.8.0.131-3.b12.el7_3.x86_64/jre
> Default locale: en_US, platform encoding: ANSI_X3.4-1968
> OS name: "linux", version: "4.9.27-moby", arch: "amd64", family: "unix"
> [root@0e3de1bf9bfc nifi-1.3.0]# uname -a
> Linux 0e3de1bf9bfc 4.9.27-moby #1 SMP Thu May 11 04:01:18 UTC 2017 x86_64
> x86_64 x86_64 GNU/Linux
> [root@0e3de1bf9bfc nifi-1.3.0]# cat /etc/redhat-release
> CentOS Linux release 7.3.1611 (Core)
>
>
>
>
>> On Mon, Jun 5, 2017 at 11:54 AM, Matt Gilman <[hidden email]> wrote:
>>
>> Hello,
>>
>>
>> I am pleased to be calling this vote for the source release of Apache NiFi
>> nifi-1.3.0.
>>
>>
>> The source zip, including signatures, digests, etc. can be found at:
>>
>> https://repository.apache.org/content/repositories/orgapachenifi-1108
>>
>>
>> The Git tag is nifi-1.3.0-RC1
>>
>> The Git commit ID is ddb73612bd1512d8b2151b81f9aa40811bca2aaa
>>
>> https://git-wip-us.apache.org/repos/asf?p=nifi.git;a=commit;h=
>> ddb73612bd1512d8b2151b81f9aa40811bca2aaa
>>
>>
>> Checksums of nifi-1.3.0-source-release.zip:
>>
>> MD5: 8b115682ac392342b9edff3bf0658ecb
>>
>> SHA1: f11cdebbabdc0d8f1f0dd4c5b880ded39d17f234
>>
>> SHA256: 9ba5565729d98c472c31a1fdbc44e9dc1eee87a2cf5184e8428743f753145b7f
>>
>>
>> Release artifacts are signed with the following key:
>>
>> https://people.apache.org/keys/committer/mcgilman.asc
>>
>>
>> KEYS file available here:
>>
>> https://dist.apache.org/repos/dist/release/nifi/KEYS
>>
>>
>> 110 issues were closed/resolved for this release:
>>
>> https://issues.apache.org/jira/secure/ReleaseNote.jspa?
>> projectId=12316020&version=12340498
>>
>>
>> Release note highlights can be found here:
>>
>> https://cwiki.apache.org/confluence/display/NIFI/
>> Release+Notes#ReleaseNotes-Version1.3.0
>>
>>
>> The vote will be open for 72 hours.
>>
>> Please download the release candidate and evaluate the necessary items
>> including checking hashes, signatures, build from source, and test.  The
>> please vote:
>>
>>
>> [ ] +1 Release this package as nifi-1.3.0
>>
>> [ ] +0 no opinion
>>
>> [ ] -1 Do not release this package because...
>>
Reply | Threaded
Open this post in threaded view
|

Re: [VOTE] Release Apache NiFi 1.3.0

Adam Taft
OK, will check out root/non-root.  Thanks for the heads up on that.  Give
me a minute, will check with a non-root user.

Adam


On Mon, Jun 5, 2017 at 4:12 PM, Joey Frazee <[hidden email]> wrote:

> Adam, this can happen if you're building as root (E.g., if you're being
> lazy like me and just using a disposable Docker container).
>
> NIFI-3836 is open for it.
>
> If this is what it is, just build as a non root user.
>
> > On Jun 5, 2017, at 5:25 PM, Adam Taft <[hidden email]> wrote:
> >
> > I'm getting a test failure for this RC.  Here is the maven snippet.
> >
> > -------------------------------------------------------
> > T E S T S
> > -------------------------------------------------------
> > Running org.apache.nifi.provenance.CryptoUtilsTest
> > Tests run: 16, Failures: 1, Errors: 0, Skipped: 0, Time elapsed: 0.761
> sec
> > <<< FAILURE! - in org.apache.nifi.provenance.CryptoUtilsTest
> > testShouldNotValidateUnreadableFileBasedKeyProvider(org.
> apache.nifi.provenance.CryptoUtilsTest)
> > Time elapsed: 0.052 sec  <<< FAILURE!
> > org.codehaus.groovy.runtime.powerassert.PowerAssertionError: assert
> > !unreadableKeyProviderIsValid
> >       ||
> >       |true
> >       false
> >    at
> > org.codehaus.groovy.runtime.InvokerHelper.assertFailed(
> InvokerHelper.java:402)
> >    at
> > org.codehaus.groovy.runtime.ScriptBytecodeAdapter.assertFailed(
> ScriptBytecodeAdapter.java:650)
> >    at
> > org.apache.nifi.provenance.CryptoUtilsTest.
> testShouldNotValidateUnreadableFileBasedKeyProvider(
> CryptoUtilsTest.groovy:214)
> > Results :
> > Failed tests:
> >  CryptoUtilsTest.testShouldNotValidateUnreadableFileBasedKeyProvider:214
> > assert !unreadableKeyProviderIsValid
> >       ||
> >       |true
> >       false
> >
> > I'm running from a clean docker container from centos:latest.  I
> installed
> > openjdk-1.8.0-devel and maven 3.5.0 into the container.  The openjdk
> comes
> > with the crypto extensions, so I don't think this is the problem.
> >
> > Any thoughts on the above?
> >
> > By the way, the signatures and hashes look good.  However I don't see a
> > 1.3.0-RC1 tag, as per your email.
> >
> > Thanks,
> >
> > Adam
> >
> > p.s. here's more environment info:
> >
> > [root@0e3de1bf9bfc nifi-1.3.0]# mvn --version
> > Apache Maven 3.5.0 (ff8f5e7444045639af65f6095c62210b5713f426;
> > 2017-04-03T19:39:06Z)
> > Maven home: /opt/apache-maven-3.5.0
> > Java version: 1.8.0_131, vendor: Oracle Corporation
> > Java home: /usr/lib/jvm/java-1.8.0-openjdk-1.8.0.131-3.b12.el7_3.
> x86_64/jre
> > Default locale: en_US, platform encoding: ANSI_X3.4-1968
> > OS name: "linux", version: "4.9.27-moby", arch: "amd64", family: "unix"
> > [root@0e3de1bf9bfc nifi-1.3.0]# uname -a
> > Linux 0e3de1bf9bfc 4.9.27-moby #1 SMP Thu May 11 04:01:18 UTC 2017 x86_64
> > x86_64 x86_64 GNU/Linux
> > [root@0e3de1bf9bfc nifi-1.3.0]# cat /etc/redhat-release
> > CentOS Linux release 7.3.1611 (Core)
> >
> >
> >
> >
> >> On Mon, Jun 5, 2017 at 11:54 AM, Matt Gilman <[hidden email]>
> wrote:
> >>
> >> Hello,
> >>
> >>
> >> I am pleased to be calling this vote for the source release of Apache
> NiFi
> >> nifi-1.3.0.
> >>
> >>
> >> The source zip, including signatures, digests, etc. can be found at:
> >>
> >> https://repository.apache.org/content/repositories/orgapachenifi-1108
> >>
> >>
> >> The Git tag is nifi-1.3.0-RC1
> >>
> >> The Git commit ID is ddb73612bd1512d8b2151b81f9aa40811bca2aaa
> >>
> >> https://git-wip-us.apache.org/repos/asf?p=nifi.git;a=commit;h=
> >> ddb73612bd1512d8b2151b81f9aa40811bca2aaa
> >>
> >>
> >> Checksums of nifi-1.3.0-source-release.zip:
> >>
> >> MD5: 8b115682ac392342b9edff3bf0658ecb
> >>
> >> SHA1: f11cdebbabdc0d8f1f0dd4c5b880ded39d17f234
> >>
> >> SHA256: 9ba5565729d98c472c31a1fdbc44e9dc1eee87a2cf5184e8428743f75314
> 5b7f
> >>
> >>
> >> Release artifacts are signed with the following key:
> >>
> >> https://people.apache.org/keys/committer/mcgilman.asc
> >>
> >>
> >> KEYS file available here:
> >>
> >> https://dist.apache.org/repos/dist/release/nifi/KEYS
> >>
> >>
> >> 110 issues were closed/resolved for this release:
> >>
> >> https://issues.apache.org/jira/secure/ReleaseNote.jspa?
> >> projectId=12316020&version=12340498
> >>
> >>
> >> Release note highlights can be found here:
> >>
> >> https://cwiki.apache.org/confluence/display/NIFI/
> >> Release+Notes#ReleaseNotes-Version1.3.0
> >>
> >>
> >> The vote will be open for 72 hours.
> >>
> >> Please download the release candidate and evaluate the necessary items
> >> including checking hashes, signatures, build from source, and test.  The
> >> please vote:
> >>
> >>
> >> [ ] +1 Release this package as nifi-1.3.0
> >>
> >> [ ] +0 no opinion
> >>
> >> [ ] -1 Do not release this package because...
> >>
>
Reply | Threaded
Open this post in threaded view
|

Re: [VOTE] Release Apache NiFi 1.3.0

Adam Taft
Got past the first error, thanks Joey.  Indeed, the non-root user was the
fix.

Unfortunately, now I'm getting another test failure.  Can anyone confirm
this one?

Running org.apache.nifi.controller.StandardFlowSynchronizerSpec
Tests run: 4, Failures: 0, Errors: 4, Skipped: 0, Time elapsed: 0.677 sec
<<< FAILURE! - in org.apache.nifi.controller.StandardFlowSynchronizerSpec
scaling of /conf/scale-positions-flow-0.7.0.xml with encoding version
"null"(org.apache.nifi.controller.StandardFlowSynchronizerSpec)  Time
elapsed: 0.485 sec  <<< ERROR!
java.lang.NullPointerException: null
    at
org.apache.nifi.controller.StandardFlowSynchronizer.readFlowFromDisk(StandardFlowSynchronizer.java:558)
    at
org.apache.nifi.controller.StandardFlowSynchronizer.sync(StandardFlowSynchronizer.java:176)
    at org.apache.nifi.controller.StandardFlowSynchronizerSpec.scaling of
#filename with encoding version
"#flowEncodingVersion"(StandardFlowSynchronizerSpec.groovy:83)

scaling of /conf/scale-positions-flow-0.7.0.xml with encoding version
"0.7"(org.apache.nifi.controller.StandardFlowSynchronizerSpec)  Time
elapsed: 0.047 sec  <<< ERROR!
java.lang.NullPointerException: null
    at
org.apache.nifi.controller.StandardFlowSynchronizer.readFlowFromDisk(StandardFlowSynchronizer.java:558)
    at
org.apache.nifi.controller.StandardFlowSynchronizer.sync(StandardFlowSynchronizer.java:176)
    at org.apache.nifi.controller.StandardFlowSynchronizerSpec.scaling of
#filename with encoding version
"#flowEncodingVersion"(StandardFlowSynchronizerSpec.groovy:83)

scaling of /conf/scale-positions-flow-0.7.0.xml with encoding version
"1.0"(org.apache.nifi.controller.StandardFlowSynchronizerSpec)  Time
elapsed: 0.036 sec  <<< ERROR!
java.lang.NullPointerException: null
    at
org.apache.nifi.controller.StandardFlowSynchronizer.readFlowFromDisk(StandardFlowSynchronizer.java:558)
    at
org.apache.nifi.controller.StandardFlowSynchronizer.sync(StandardFlowSynchronizer.java:176)
    at org.apache.nifi.controller.StandardFlowSynchronizerSpec.scaling of
#filename with encoding version
"#flowEncodingVersion"(StandardFlowSynchronizerSpec.groovy:83)

scaling of /conf/scale-positions-flow-0.7.0.xml with encoding version
"99.0"(org.apache.nifi.controller.StandardFlowSynchronizerSpec)  Time
elapsed: 0.037 sec  <<< ERROR!
java.lang.NullPointerException: null
    at
org.apache.nifi.controller.StandardFlowSynchronizer.readFlowFromDisk(StandardFlowSynchronizer.java:558)
    at
org.apache.nifi.controller.StandardFlowSynchronizer.sync(StandardFlowSynchronizer.java:176)
    at org.apache.nifi.controller.StandardFlowSynchronizerSpec.scaling of
#filename with encoding version
"#flowEncodingVersion"(StandardFlowSynchronizerSpec.groovy:83)

Results :
Tests in error:
  StandardFlowSynchronizerSpec.scaling of #filename with encoding version
"#flowEncodingVersion":83 ? NullPointer
  StandardFlowSynchronizerSpec.scaling of #filename with encoding version
"#flowEncodingVersion":83 ? NullPointer
  StandardFlowSynchronizerSpec.scaling of #filename with encoding version
"#flowEncodingVersion":83 ? NullPointer
  StandardFlowSynchronizerSpec.scaling of #filename with encoding version
"#flowEncodingVersion":83 ? NullPointer






On Mon, Jun 5, 2017 at 4:18 PM, Adam Taft <[hidden email]> wrote:

> OK, will check out root/non-root.  Thanks for the heads up on that.  Give
> me a minute, will check with a non-root user.
>
> Adam
>
>
> On Mon, Jun 5, 2017 at 4:12 PM, Joey Frazee <[hidden email]>
> wrote:
>
>> Adam, this can happen if you're building as root (E.g., if you're being
>> lazy like me and just using a disposable Docker container).
>>
>> NIFI-3836 is open for it.
>>
>> If this is what it is, just build as a non root user.
>>
>> > On Jun 5, 2017, at 5:25 PM, Adam Taft <[hidden email]> wrote:
>> >
>> > I'm getting a test failure for this RC.  Here is the maven snippet.
>> >
>> > -------------------------------------------------------
>> > T E S T S
>> > -------------------------------------------------------
>> > Running org.apache.nifi.provenance.CryptoUtilsTest
>> > Tests run: 16, Failures: 1, Errors: 0, Skipped: 0, Time elapsed: 0.761
>> sec
>> > <<< FAILURE! - in org.apache.nifi.provenance.CryptoUtilsTest
>> > testShouldNotValidateUnreadableFileBasedKeyProvider(org.apac
>> he.nifi.provenance.CryptoUtilsTest)
>> > Time elapsed: 0.052 sec  <<< FAILURE!
>> > org.codehaus.groovy.runtime.powerassert.PowerAssertionError: assert
>> > !unreadableKeyProviderIsValid
>> >       ||
>> >       |true
>> >       false
>> >    at
>> > org.codehaus.groovy.runtime.InvokerHelper.assertFailed(Invok
>> erHelper.java:402)
>> >    at
>> > org.codehaus.groovy.runtime.ScriptBytecodeAdapter.assertFail
>> ed(ScriptBytecodeAdapter.java:650)
>> >    at
>> > org.apache.nifi.provenance.CryptoUtilsTest.testShouldNotVali
>> dateUnreadableFileBasedKeyProvider(CryptoUtilsTest.groovy:214)
>> > Results :
>> > Failed tests:
>> >  CryptoUtilsTest.testShouldNotValidateUnreadableFileBasedKeyP
>> rovider:214
>> > assert !unreadableKeyProviderIsValid
>> >       ||
>> >       |true
>> >       false
>> >
>> > I'm running from a clean docker container from centos:latest.  I
>> installed
>> > openjdk-1.8.0-devel and maven 3.5.0 into the container.  The openjdk
>> comes
>> > with the crypto extensions, so I don't think this is the problem.
>> >
>> > Any thoughts on the above?
>> >
>> > By the way, the signatures and hashes look good.  However I don't see a
>> > 1.3.0-RC1 tag, as per your email.
>> >
>> > Thanks,
>> >
>> > Adam
>> >
>> > p.s. here's more environment info:
>> >
>> > [root@0e3de1bf9bfc nifi-1.3.0]# mvn --version
>> > Apache Maven 3.5.0 (ff8f5e7444045639af65f6095c62210b5713f426;
>> > 2017-04-03T19:39:06Z)
>> > Maven home: /opt/apache-maven-3.5.0
>> > Java version: 1.8.0_131, vendor: Oracle Corporation
>> > Java home: /usr/lib/jvm/java-1.8.0-openjdk-1.8.0.131-3.b12.el7_3.x86_
>> 64/jre
>> > Default locale: en_US, platform encoding: ANSI_X3.4-1968
>> > OS name: "linux", version: "4.9.27-moby", arch: "amd64", family: "unix"
>> > [root@0e3de1bf9bfc nifi-1.3.0]# uname -a
>> > Linux 0e3de1bf9bfc 4.9.27-moby #1 SMP Thu May 11 04:01:18 UTC 2017
>> x86_64
>> > x86_64 x86_64 GNU/Linux
>> > [root@0e3de1bf9bfc nifi-1.3.0]# cat /etc/redhat-release
>> > CentOS Linux release 7.3.1611 (Core)
>> >
>> >
>> >
>> >
>> >> On Mon, Jun 5, 2017 at 11:54 AM, Matt Gilman <[hidden email]>
>> wrote:
>> >>
>> >> Hello,
>> >>
>> >>
>> >> I am pleased to be calling this vote for the source release of Apache
>> NiFi
>> >> nifi-1.3.0.
>> >>
>> >>
>> >> The source zip, including signatures, digests, etc. can be found at:
>> >>
>> >> https://repository.apache.org/content/repositories/orgapachenifi-1108
>> >>
>> >>
>> >> The Git tag is nifi-1.3.0-RC1
>> >>
>> >> The Git commit ID is ddb73612bd1512d8b2151b81f9aa40811bca2aaa
>> >>
>> >> https://git-wip-us.apache.org/repos/asf?p=nifi.git;a=commit;h=
>> >> ddb73612bd1512d8b2151b81f9aa40811bca2aaa
>> >>
>> >>
>> >> Checksums of nifi-1.3.0-source-release.zip:
>> >>
>> >> MD5: 8b115682ac392342b9edff3bf0658ecb
>> >>
>> >> SHA1: f11cdebbabdc0d8f1f0dd4c5b880ded39d17f234
>> >>
>> >> SHA256: 9ba5565729d98c472c31a1fdbc44e9dc1eee87a2cf5184e8428743f75314
>> 5b7f
>> >>
>> >>
>> >> Release artifacts are signed with the following key:
>> >>
>> >> https://people.apache.org/keys/committer/mcgilman.asc
>> >>
>> >>
>> >> KEYS file available here:
>> >>
>> >> https://dist.apache.org/repos/dist/release/nifi/KEYS
>> >>
>> >>
>> >> 110 issues were closed/resolved for this release:
>> >>
>> >> https://issues.apache.org/jira/secure/ReleaseNote.jspa?
>> >> projectId=12316020&version=12340498
>> >>
>> >>
>> >> Release note highlights can be found here:
>> >>
>> >> https://cwiki.apache.org/confluence/display/NIFI/
>> >> Release+Notes#ReleaseNotes-Version1.3.0
>> >>
>> >>
>> >> The vote will be open for 72 hours.
>> >>
>> >> Please download the release candidate and evaluate the necessary items
>> >> including checking hashes, signatures, build from source, and test.
>> The
>> >> please vote:
>> >>
>> >>
>> >> [ ] +1 Release this package as nifi-1.3.0
>> >>
>> >> [ ] +0 no opinion
>> >>
>> >> [ ] -1 Do not release this package because...
>> >>
>>
>
>
Reply | Threaded
Open this post in threaded view
|

Re: [VOTE] Release Apache NiFi 1.3.0

Jeff-2
Hi Adam,

StandardFlowSynchronizerSpec via command line maven on my MBP passes
successfully, but I do see the same errors as you when running the tests
for StandardFlowSynchronizerSpec through IntelliJ.

On Mon, Jun 5, 2017 at 6:56 PM Adam Taft <[hidden email]> wrote:

> Got past the first error, thanks Joey.  Indeed, the non-root user was the
> fix.
>
> Unfortunately, now I'm getting another test failure.  Can anyone confirm
> this one?
>
> Running org.apache.nifi.controller.StandardFlowSynchronizerSpec
> Tests run: 4, Failures: 0, Errors: 4, Skipped: 0, Time elapsed: 0.677 sec
> <<< FAILURE! - in org.apache.nifi.controller.StandardFlowSynchronizerSpec
> scaling of /conf/scale-positions-flow-0.7.0.xml with encoding version
> "null"(org.apache.nifi.controller.StandardFlowSynchronizerSpec)  Time
> elapsed: 0.485 sec  <<< ERROR!
> java.lang.NullPointerException: null
>     at
>
> org.apache.nifi.controller.StandardFlowSynchronizer.readFlowFromDisk(StandardFlowSynchronizer.java:558)
>     at
>
> org.apache.nifi.controller.StandardFlowSynchronizer.sync(StandardFlowSynchronizer.java:176)
>     at org.apache.nifi.controller.StandardFlowSynchronizerSpec.scaling of
> #filename with encoding version
> "#flowEncodingVersion"(StandardFlowSynchronizerSpec.groovy:83)
>
> scaling of /conf/scale-positions-flow-0.7.0.xml with encoding version
> "0.7"(org.apache.nifi.controller.StandardFlowSynchronizerSpec)  Time
> elapsed: 0.047 sec  <<< ERROR!
> java.lang.NullPointerException: null
>     at
>
> org.apache.nifi.controller.StandardFlowSynchronizer.readFlowFromDisk(StandardFlowSynchronizer.java:558)
>     at
>
> org.apache.nifi.controller.StandardFlowSynchronizer.sync(StandardFlowSynchronizer.java:176)
>     at org.apache.nifi.controller.StandardFlowSynchronizerSpec.scaling of
> #filename with encoding version
> "#flowEncodingVersion"(StandardFlowSynchronizerSpec.groovy:83)
>
> scaling of /conf/scale-positions-flow-0.7.0.xml with encoding version
> "1.0"(org.apache.nifi.controller.StandardFlowSynchronizerSpec)  Time
> elapsed: 0.036 sec  <<< ERROR!
> java.lang.NullPointerException: null
>     at
>
> org.apache.nifi.controller.StandardFlowSynchronizer.readFlowFromDisk(StandardFlowSynchronizer.java:558)
>     at
>
> org.apache.nifi.controller.StandardFlowSynchronizer.sync(StandardFlowSynchronizer.java:176)
>     at org.apache.nifi.controller.StandardFlowSynchronizerSpec.scaling of
> #filename with encoding version
> "#flowEncodingVersion"(StandardFlowSynchronizerSpec.groovy:83)
>
> scaling of /conf/scale-positions-flow-0.7.0.xml with encoding version
> "99.0"(org.apache.nifi.controller.StandardFlowSynchronizerSpec)  Time
> elapsed: 0.037 sec  <<< ERROR!
> java.lang.NullPointerException: null
>     at
>
> org.apache.nifi.controller.StandardFlowSynchronizer.readFlowFromDisk(StandardFlowSynchronizer.java:558)
>     at
>
> org.apache.nifi.controller.StandardFlowSynchronizer.sync(StandardFlowSynchronizer.java:176)
>     at org.apache.nifi.controller.StandardFlowSynchronizerSpec.scaling of
> #filename with encoding version
> "#flowEncodingVersion"(StandardFlowSynchronizerSpec.groovy:83)
>
> Results :
> Tests in error:
>   StandardFlowSynchronizerSpec.scaling of #filename with encoding version
> "#flowEncodingVersion":83 ? NullPointer
>   StandardFlowSynchronizerSpec.scaling of #filename with encoding version
> "#flowEncodingVersion":83 ? NullPointer
>   StandardFlowSynchronizerSpec.scaling of #filename with encoding version
> "#flowEncodingVersion":83 ? NullPointer
>   StandardFlowSynchronizerSpec.scaling of #filename with encoding version
> "#flowEncodingVersion":83 ? NullPointer
>
>
>
>
>
>
> On Mon, Jun 5, 2017 at 4:18 PM, Adam Taft <[hidden email]> wrote:
>
> > OK, will check out root/non-root.  Thanks for the heads up on that.  Give
> > me a minute, will check with a non-root user.
> >
> > Adam
> >
> >
> > On Mon, Jun 5, 2017 at 4:12 PM, Joey Frazee <[hidden email]>
> > wrote:
> >
> >> Adam, this can happen if you're building as root (E.g., if you're being
> >> lazy like me and just using a disposable Docker container).
> >>
> >> NIFI-3836 is open for it.
> >>
> >> If this is what it is, just build as a non root user.
> >>
> >> > On Jun 5, 2017, at 5:25 PM, Adam Taft <[hidden email]> wrote:
> >> >
> >> > I'm getting a test failure for this RC.  Here is the maven snippet.
> >> >
> >> > -------------------------------------------------------
> >> > T E S T S
> >> > -------------------------------------------------------
> >> > Running org.apache.nifi.provenance.CryptoUtilsTest
> >> > Tests run: 16, Failures: 1, Errors: 0, Skipped: 0, Time elapsed: 0.761
> >> sec
> >> > <<< FAILURE! - in org.apache.nifi.provenance.CryptoUtilsTest
> >> > testShouldNotValidateUnreadableFileBasedKeyProvider(org.apac
> >> he.nifi.provenance.CryptoUtilsTest)
> >> > Time elapsed: 0.052 sec  <<< FAILURE!
> >> > org.codehaus.groovy.runtime.powerassert.PowerAssertionError: assert
> >> > !unreadableKeyProviderIsValid
> >> >       ||
> >> >       |true
> >> >       false
> >> >    at
> >> > org.codehaus.groovy.runtime.InvokerHelper.assertFailed(Invok
> >> erHelper.java:402)
> >> >    at
> >> > org.codehaus.groovy.runtime.ScriptBytecodeAdapter.assertFail
> >> ed(ScriptBytecodeAdapter.java:650)
> >> >    at
> >> > org.apache.nifi.provenance.CryptoUtilsTest.testShouldNotVali
> >> dateUnreadableFileBasedKeyProvider(CryptoUtilsTest.groovy:214)
> >> > Results :
> >> > Failed tests:
> >> >  CryptoUtilsTest.testShouldNotValidateUnreadableFileBasedKeyP
> >> rovider:214
> >> > assert !unreadableKeyProviderIsValid
> >> >       ||
> >> >       |true
> >> >       false
> >> >
> >> > I'm running from a clean docker container from centos:latest.  I
> >> installed
> >> > openjdk-1.8.0-devel and maven 3.5.0 into the container.  The openjdk
> >> comes
> >> > with the crypto extensions, so I don't think this is the problem.
> >> >
> >> > Any thoughts on the above?
> >> >
> >> > By the way, the signatures and hashes look good.  However I don't see
> a
> >> > 1.3.0-RC1 tag, as per your email.
> >> >
> >> > Thanks,
> >> >
> >> > Adam
> >> >
> >> > p.s. here's more environment info:
> >> >
> >> > [root@0e3de1bf9bfc nifi-1.3.0]# mvn --version
> >> > Apache Maven 3.5.0 (ff8f5e7444045639af65f6095c62210b5713f426;
> >> > 2017-04-03T19:39:06Z)
> >> > Maven home: /opt/apache-maven-3.5.0
> >> > Java version: 1.8.0_131, vendor: Oracle Corporation
> >> > Java home: /usr/lib/jvm/java-1.8.0-openjdk-1.8.0.131-3.b12.el7_3.x86_
> >> 64/jre
> >> > Default locale: en_US, platform encoding: ANSI_X3.4-1968
> >> > OS name: "linux", version: "4.9.27-moby", arch: "amd64", family:
> "unix"
> >> > [root@0e3de1bf9bfc nifi-1.3.0]# uname -a
> >> > Linux 0e3de1bf9bfc 4.9.27-moby #1 SMP Thu May 11 04:01:18 UTC 2017
> >> x86_64
> >> > x86_64 x86_64 GNU/Linux
> >> > [root@0e3de1bf9bfc nifi-1.3.0]# cat /etc/redhat-release
> >> > CentOS Linux release 7.3.1611 (Core)
> >> >
> >> >
> >> >
> >> >
> >> >> On Mon, Jun 5, 2017 at 11:54 AM, Matt Gilman <[hidden email]>
> >> wrote:
> >> >>
> >> >> Hello,
> >> >>
> >> >>
> >> >> I am pleased to be calling this vote for the source release of Apache
> >> NiFi
> >> >> nifi-1.3.0.
> >> >>
> >> >>
> >> >> The source zip, including signatures, digests, etc. can be found at:
> >> >>
> >> >>
> https://repository.apache.org/content/repositories/orgapachenifi-1108
> >> >>
> >> >>
> >> >> The Git tag is nifi-1.3.0-RC1
> >> >>
> >> >> The Git commit ID is ddb73612bd1512d8b2151b81f9aa40811bca2aaa
> >> >>
> >> >> https://git-wip-us.apache.org/repos/asf?p=nifi.git;a=commit;h=
> >> >> ddb73612bd1512d8b2151b81f9aa40811bca2aaa
> >> >>
> >> >>
> >> >> Checksums of nifi-1.3.0-source-release.zip:
> >> >>
> >> >> MD5: 8b115682ac392342b9edff3bf0658ecb
> >> >>
> >> >> SHA1: f11cdebbabdc0d8f1f0dd4c5b880ded39d17f234
> >> >>
> >> >> SHA256: 9ba5565729d98c472c31a1fdbc44e9dc1eee87a2cf5184e8428743f75314
> >> 5b7f
> >> >>
> >> >>
> >> >> Release artifacts are signed with the following key:
> >> >>
> >> >> https://people.apache.org/keys/committer/mcgilman.asc
> >> >>
> >> >>
> >> >> KEYS file available here:
> >> >>
> >> >> https://dist.apache.org/repos/dist/release/nifi/KEYS
> >> >>
> >> >>
> >> >> 110 issues were closed/resolved for this release:
> >> >>
> >> >> https://issues.apache.org/jira/secure/ReleaseNote.jspa?
> >> >> projectId=12316020&version=12340498
> >> >>
> >> >>
> >> >> Release note highlights can be found here:
> >> >>
> >> >> https://cwiki.apache.org/confluence/display/NIFI/
> >> >> Release+Notes#ReleaseNotes-Version1.3.0
> >> >>
> >> >>
> >> >> The vote will be open for 72 hours.
> >> >>
> >> >> Please download the release candidate and evaluate the necessary
> items
> >> >> including checking hashes, signatures, build from source, and test.
> >> The
> >> >> please vote:
> >> >>
> >> >>
> >> >> [ ] +1 Release this package as nifi-1.3.0
> >> >>
> >> >> [ ] +0 no opinion
> >> >>
> >> >> [ ] -1 Do not release this package because...
> >> >>
> >>
> >
> >
>
Reply | Threaded
Open this post in threaded view
|

Re: [VOTE] Release Apache NiFi 1.3.0

Koji Kawamura
Hi Adam, Jeff,

StandardFlowSynchronizerSpec relies on System.property so it can pass
if other test sets 'nifi.properties.file.path'.
I think I found how to fix the test class. I will create a JIRA and
send a PR for it.

Thanks,
Koji

On Tue, Jun 6, 2017 at 9:35 AM, Jeff <[hidden email]> wrote:

> Hi Adam,
>
> StandardFlowSynchronizerSpec via command line maven on my MBP passes
> successfully, but I do see the same errors as you when running the tests
> for StandardFlowSynchronizerSpec through IntelliJ.
>
> On Mon, Jun 5, 2017 at 6:56 PM Adam Taft <[hidden email]> wrote:
>
>> Got past the first error, thanks Joey.  Indeed, the non-root user was the
>> fix.
>>
>> Unfortunately, now I'm getting another test failure.  Can anyone confirm
>> this one?
>>
>> Running org.apache.nifi.controller.StandardFlowSynchronizerSpec
>> Tests run: 4, Failures: 0, Errors: 4, Skipped: 0, Time elapsed: 0.677 sec
>> <<< FAILURE! - in org.apache.nifi.controller.StandardFlowSynchronizerSpec
>> scaling of /conf/scale-positions-flow-0.7.0.xml with encoding version
>> "null"(org.apache.nifi.controller.StandardFlowSynchronizerSpec)  Time
>> elapsed: 0.485 sec  <<< ERROR!
>> java.lang.NullPointerException: null
>>     at
>>
>> org.apache.nifi.controller.StandardFlowSynchronizer.readFlowFromDisk(StandardFlowSynchronizer.java:558)
>>     at
>>
>> org.apache.nifi.controller.StandardFlowSynchronizer.sync(StandardFlowSynchronizer.java:176)
>>     at org.apache.nifi.controller.StandardFlowSynchronizerSpec.scaling of
>> #filename with encoding version
>> "#flowEncodingVersion"(StandardFlowSynchronizerSpec.groovy:83)
>>
>> scaling of /conf/scale-positions-flow-0.7.0.xml with encoding version
>> "0.7"(org.apache.nifi.controller.StandardFlowSynchronizerSpec)  Time
>> elapsed: 0.047 sec  <<< ERROR!
>> java.lang.NullPointerException: null
>>     at
>>
>> org.apache.nifi.controller.StandardFlowSynchronizer.readFlowFromDisk(StandardFlowSynchronizer.java:558)
>>     at
>>
>> org.apache.nifi.controller.StandardFlowSynchronizer.sync(StandardFlowSynchronizer.java:176)
>>     at org.apache.nifi.controller.StandardFlowSynchronizerSpec.scaling of
>> #filename with encoding version
>> "#flowEncodingVersion"(StandardFlowSynchronizerSpec.groovy:83)
>>
>> scaling of /conf/scale-positions-flow-0.7.0.xml with encoding version
>> "1.0"(org.apache.nifi.controller.StandardFlowSynchronizerSpec)  Time
>> elapsed: 0.036 sec  <<< ERROR!
>> java.lang.NullPointerException: null
>>     at
>>
>> org.apache.nifi.controller.StandardFlowSynchronizer.readFlowFromDisk(StandardFlowSynchronizer.java:558)
>>     at
>>
>> org.apache.nifi.controller.StandardFlowSynchronizer.sync(StandardFlowSynchronizer.java:176)
>>     at org.apache.nifi.controller.StandardFlowSynchronizerSpec.scaling of
>> #filename with encoding version
>> "#flowEncodingVersion"(StandardFlowSynchronizerSpec.groovy:83)
>>
>> scaling of /conf/scale-positions-flow-0.7.0.xml with encoding version
>> "99.0"(org.apache.nifi.controller.StandardFlowSynchronizerSpec)  Time
>> elapsed: 0.037 sec  <<< ERROR!
>> java.lang.NullPointerException: null
>>     at
>>
>> org.apache.nifi.controller.StandardFlowSynchronizer.readFlowFromDisk(StandardFlowSynchronizer.java:558)
>>     at
>>
>> org.apache.nifi.controller.StandardFlowSynchronizer.sync(StandardFlowSynchronizer.java:176)
>>     at org.apache.nifi.controller.StandardFlowSynchronizerSpec.scaling of
>> #filename with encoding version
>> "#flowEncodingVersion"(StandardFlowSynchronizerSpec.groovy:83)
>>
>> Results :
>> Tests in error:
>>   StandardFlowSynchronizerSpec.scaling of #filename with encoding version
>> "#flowEncodingVersion":83 ? NullPointer
>>   StandardFlowSynchronizerSpec.scaling of #filename with encoding version
>> "#flowEncodingVersion":83 ? NullPointer
>>   StandardFlowSynchronizerSpec.scaling of #filename with encoding version
>> "#flowEncodingVersion":83 ? NullPointer
>>   StandardFlowSynchronizerSpec.scaling of #filename with encoding version
>> "#flowEncodingVersion":83 ? NullPointer
>>
>>
>>
>>
>>
>>
>> On Mon, Jun 5, 2017 at 4:18 PM, Adam Taft <[hidden email]> wrote:
>>
>> > OK, will check out root/non-root.  Thanks for the heads up on that.  Give
>> > me a minute, will check with a non-root user.
>> >
>> > Adam
>> >
>> >
>> > On Mon, Jun 5, 2017 at 4:12 PM, Joey Frazee <[hidden email]>
>> > wrote:
>> >
>> >> Adam, this can happen if you're building as root (E.g., if you're being
>> >> lazy like me and just using a disposable Docker container).
>> >>
>> >> NIFI-3836 is open for it.
>> >>
>> >> If this is what it is, just build as a non root user.
>> >>
>> >> > On Jun 5, 2017, at 5:25 PM, Adam Taft <[hidden email]> wrote:
>> >> >
>> >> > I'm getting a test failure for this RC.  Here is the maven snippet.
>> >> >
>> >> > -------------------------------------------------------
>> >> > T E S T S
>> >> > -------------------------------------------------------
>> >> > Running org.apache.nifi.provenance.CryptoUtilsTest
>> >> > Tests run: 16, Failures: 1, Errors: 0, Skipped: 0, Time elapsed: 0.761
>> >> sec
>> >> > <<< FAILURE! - in org.apache.nifi.provenance.CryptoUtilsTest
>> >> > testShouldNotValidateUnreadableFileBasedKeyProvider(org.apac
>> >> he.nifi.provenance.CryptoUtilsTest)
>> >> > Time elapsed: 0.052 sec  <<< FAILURE!
>> >> > org.codehaus.groovy.runtime.powerassert.PowerAssertionError: assert
>> >> > !unreadableKeyProviderIsValid
>> >> >       ||
>> >> >       |true
>> >> >       false
>> >> >    at
>> >> > org.codehaus.groovy.runtime.InvokerHelper.assertFailed(Invok
>> >> erHelper.java:402)
>> >> >    at
>> >> > org.codehaus.groovy.runtime.ScriptBytecodeAdapter.assertFail
>> >> ed(ScriptBytecodeAdapter.java:650)
>> >> >    at
>> >> > org.apache.nifi.provenance.CryptoUtilsTest.testShouldNotVali
>> >> dateUnreadableFileBasedKeyProvider(CryptoUtilsTest.groovy:214)
>> >> > Results :
>> >> > Failed tests:
>> >> >  CryptoUtilsTest.testShouldNotValidateUnreadableFileBasedKeyP
>> >> rovider:214
>> >> > assert !unreadableKeyProviderIsValid
>> >> >       ||
>> >> >       |true
>> >> >       false
>> >> >
>> >> > I'm running from a clean docker container from centos:latest.  I
>> >> installed
>> >> > openjdk-1.8.0-devel and maven 3.5.0 into the container.  The openjdk
>> >> comes
>> >> > with the crypto extensions, so I don't think this is the problem.
>> >> >
>> >> > Any thoughts on the above?
>> >> >
>> >> > By the way, the signatures and hashes look good.  However I don't see
>> a
>> >> > 1.3.0-RC1 tag, as per your email.
>> >> >
>> >> > Thanks,
>> >> >
>> >> > Adam
>> >> >
>> >> > p.s. here's more environment info:
>> >> >
>> >> > [root@0e3de1bf9bfc nifi-1.3.0]# mvn --version
>> >> > Apache Maven 3.5.0 (ff8f5e7444045639af65f6095c62210b5713f426;
>> >> > 2017-04-03T19:39:06Z)
>> >> > Maven home: /opt/apache-maven-3.5.0
>> >> > Java version: 1.8.0_131, vendor: Oracle Corporation
>> >> > Java home: /usr/lib/jvm/java-1.8.0-openjdk-1.8.0.131-3.b12.el7_3.x86_
>> >> 64/jre
>> >> > Default locale: en_US, platform encoding: ANSI_X3.4-1968
>> >> > OS name: "linux", version: "4.9.27-moby", arch: "amd64", family:
>> "unix"
>> >> > [root@0e3de1bf9bfc nifi-1.3.0]# uname -a
>> >> > Linux 0e3de1bf9bfc 4.9.27-moby #1 SMP Thu May 11 04:01:18 UTC 2017
>> >> x86_64
>> >> > x86_64 x86_64 GNU/Linux
>> >> > [root@0e3de1bf9bfc nifi-1.3.0]# cat /etc/redhat-release
>> >> > CentOS Linux release 7.3.1611 (Core)
>> >> >
>> >> >
>> >> >
>> >> >
>> >> >> On Mon, Jun 5, 2017 at 11:54 AM, Matt Gilman <[hidden email]>
>> >> wrote:
>> >> >>
>> >> >> Hello,
>> >> >>
>> >> >>
>> >> >> I am pleased to be calling this vote for the source release of Apache
>> >> NiFi
>> >> >> nifi-1.3.0.
>> >> >>
>> >> >>
>> >> >> The source zip, including signatures, digests, etc. can be found at:
>> >> >>
>> >> >>
>> https://repository.apache.org/content/repositories/orgapachenifi-1108
>> >> >>
>> >> >>
>> >> >> The Git tag is nifi-1.3.0-RC1
>> >> >>
>> >> >> The Git commit ID is ddb73612bd1512d8b2151b81f9aa40811bca2aaa
>> >> >>
>> >> >> https://git-wip-us.apache.org/repos/asf?p=nifi.git;a=commit;h=
>> >> >> ddb73612bd1512d8b2151b81f9aa40811bca2aaa
>> >> >>
>> >> >>
>> >> >> Checksums of nifi-1.3.0-source-release.zip:
>> >> >>
>> >> >> MD5: 8b115682ac392342b9edff3bf0658ecb
>> >> >>
>> >> >> SHA1: f11cdebbabdc0d8f1f0dd4c5b880ded39d17f234
>> >> >>
>> >> >> SHA256: 9ba5565729d98c472c31a1fdbc44e9dc1eee87a2cf5184e8428743f75314
>> >> 5b7f
>> >> >>
>> >> >>
>> >> >> Release artifacts are signed with the following key:
>> >> >>
>> >> >> https://people.apache.org/keys/committer/mcgilman.asc
>> >> >>
>> >> >>
>> >> >> KEYS file available here:
>> >> >>
>> >> >> https://dist.apache.org/repos/dist/release/nifi/KEYS
>> >> >>
>> >> >>
>> >> >> 110 issues were closed/resolved for this release:
>> >> >>
>> >> >> https://issues.apache.org/jira/secure/ReleaseNote.jspa?
>> >> >> projectId=12316020&version=12340498
>> >> >>
>> >> >>
>> >> >> Release note highlights can be found here:
>> >> >>
>> >> >> https://cwiki.apache.org/confluence/display/NIFI/
>> >> >> Release+Notes#ReleaseNotes-Version1.3.0
>> >> >>
>> >> >>
>> >> >> The vote will be open for 72 hours.
>> >> >>
>> >> >> Please download the release candidate and evaluate the necessary
>> items
>> >> >> including checking hashes, signatures, build from source, and test.
>> >> The
>> >> >> please vote:
>> >> >>
>> >> >>
>> >> >> [ ] +1 Release this package as nifi-1.3.0
>> >> >>
>> >> >> [ ] +0 no opinion
>> >> >>
>> >> >> [ ] -1 Do not release this package because...
>> >> >>
>> >>
>> >
>> >
>>
Reply | Threaded
Open this post in threaded view
|

Re: [VOTE] Release Apache NiFi 1.3.0

Koji Kawamura
Filed https://issues.apache.org/jira/browse/NIFI-4021
And PullRequest https://github.com/apache/nifi/pull/1892

On Tue, Jun 6, 2017 at 10:54 AM, Koji Kawamura <[hidden email]> wrote:

> Hi Adam, Jeff,
>
> StandardFlowSynchronizerSpec relies on System.property so it can pass
> if other test sets 'nifi.properties.file.path'.
> I think I found how to fix the test class. I will create a JIRA and
> send a PR for it.
>
> Thanks,
> Koji
>
> On Tue, Jun 6, 2017 at 9:35 AM, Jeff <[hidden email]> wrote:
>> Hi Adam,
>>
>> StandardFlowSynchronizerSpec via command line maven on my MBP passes
>> successfully, but I do see the same errors as you when running the tests
>> for StandardFlowSynchronizerSpec through IntelliJ.
>>
>> On Mon, Jun 5, 2017 at 6:56 PM Adam Taft <[hidden email]> wrote:
>>
>>> Got past the first error, thanks Joey.  Indeed, the non-root user was the
>>> fix.
>>>
>>> Unfortunately, now I'm getting another test failure.  Can anyone confirm
>>> this one?
>>>
>>> Running org.apache.nifi.controller.StandardFlowSynchronizerSpec
>>> Tests run: 4, Failures: 0, Errors: 4, Skipped: 0, Time elapsed: 0.677 sec
>>> <<< FAILURE! - in org.apache.nifi.controller.StandardFlowSynchronizerSpec
>>> scaling of /conf/scale-positions-flow-0.7.0.xml with encoding version
>>> "null"(org.apache.nifi.controller.StandardFlowSynchronizerSpec)  Time
>>> elapsed: 0.485 sec  <<< ERROR!
>>> java.lang.NullPointerException: null
>>>     at
>>>
>>> org.apache.nifi.controller.StandardFlowSynchronizer.readFlowFromDisk(StandardFlowSynchronizer.java:558)
>>>     at
>>>
>>> org.apache.nifi.controller.StandardFlowSynchronizer.sync(StandardFlowSynchronizer.java:176)
>>>     at org.apache.nifi.controller.StandardFlowSynchronizerSpec.scaling of
>>> #filename with encoding version
>>> "#flowEncodingVersion"(StandardFlowSynchronizerSpec.groovy:83)
>>>
>>> scaling of /conf/scale-positions-flow-0.7.0.xml with encoding version
>>> "0.7"(org.apache.nifi.controller.StandardFlowSynchronizerSpec)  Time
>>> elapsed: 0.047 sec  <<< ERROR!
>>> java.lang.NullPointerException: null
>>>     at
>>>
>>> org.apache.nifi.controller.StandardFlowSynchronizer.readFlowFromDisk(StandardFlowSynchronizer.java:558)
>>>     at
>>>
>>> org.apache.nifi.controller.StandardFlowSynchronizer.sync(StandardFlowSynchronizer.java:176)
>>>     at org.apache.nifi.controller.StandardFlowSynchronizerSpec.scaling of
>>> #filename with encoding version
>>> "#flowEncodingVersion"(StandardFlowSynchronizerSpec.groovy:83)
>>>
>>> scaling of /conf/scale-positions-flow-0.7.0.xml with encoding version
>>> "1.0"(org.apache.nifi.controller.StandardFlowSynchronizerSpec)  Time
>>> elapsed: 0.036 sec  <<< ERROR!
>>> java.lang.NullPointerException: null
>>>     at
>>>
>>> org.apache.nifi.controller.StandardFlowSynchronizer.readFlowFromDisk(StandardFlowSynchronizer.java:558)
>>>     at
>>>
>>> org.apache.nifi.controller.StandardFlowSynchronizer.sync(StandardFlowSynchronizer.java:176)
>>>     at org.apache.nifi.controller.StandardFlowSynchronizerSpec.scaling of
>>> #filename with encoding version
>>> "#flowEncodingVersion"(StandardFlowSynchronizerSpec.groovy:83)
>>>
>>> scaling of /conf/scale-positions-flow-0.7.0.xml with encoding version
>>> "99.0"(org.apache.nifi.controller.StandardFlowSynchronizerSpec)  Time
>>> elapsed: 0.037 sec  <<< ERROR!
>>> java.lang.NullPointerException: null
>>>     at
>>>
>>> org.apache.nifi.controller.StandardFlowSynchronizer.readFlowFromDisk(StandardFlowSynchronizer.java:558)
>>>     at
>>>
>>> org.apache.nifi.controller.StandardFlowSynchronizer.sync(StandardFlowSynchronizer.java:176)
>>>     at org.apache.nifi.controller.StandardFlowSynchronizerSpec.scaling of
>>> #filename with encoding version
>>> "#flowEncodingVersion"(StandardFlowSynchronizerSpec.groovy:83)
>>>
>>> Results :
>>> Tests in error:
>>>   StandardFlowSynchronizerSpec.scaling of #filename with encoding version
>>> "#flowEncodingVersion":83 ? NullPointer
>>>   StandardFlowSynchronizerSpec.scaling of #filename with encoding version
>>> "#flowEncodingVersion":83 ? NullPointer
>>>   StandardFlowSynchronizerSpec.scaling of #filename with encoding version
>>> "#flowEncodingVersion":83 ? NullPointer
>>>   StandardFlowSynchronizerSpec.scaling of #filename with encoding version
>>> "#flowEncodingVersion":83 ? NullPointer
>>>
>>>
>>>
>>>
>>>
>>>
>>> On Mon, Jun 5, 2017 at 4:18 PM, Adam Taft <[hidden email]> wrote:
>>>
>>> > OK, will check out root/non-root.  Thanks for the heads up on that.  Give
>>> > me a minute, will check with a non-root user.
>>> >
>>> > Adam
>>> >
>>> >
>>> > On Mon, Jun 5, 2017 at 4:12 PM, Joey Frazee <[hidden email]>
>>> > wrote:
>>> >
>>> >> Adam, this can happen if you're building as root (E.g., if you're being
>>> >> lazy like me and just using a disposable Docker container).
>>> >>
>>> >> NIFI-3836 is open for it.
>>> >>
>>> >> If this is what it is, just build as a non root user.
>>> >>
>>> >> > On Jun 5, 2017, at 5:25 PM, Adam Taft <[hidden email]> wrote:
>>> >> >
>>> >> > I'm getting a test failure for this RC.  Here is the maven snippet.
>>> >> >
>>> >> > -------------------------------------------------------
>>> >> > T E S T S
>>> >> > -------------------------------------------------------
>>> >> > Running org.apache.nifi.provenance.CryptoUtilsTest
>>> >> > Tests run: 16, Failures: 1, Errors: 0, Skipped: 0, Time elapsed: 0.761
>>> >> sec
>>> >> > <<< FAILURE! - in org.apache.nifi.provenance.CryptoUtilsTest
>>> >> > testShouldNotValidateUnreadableFileBasedKeyProvider(org.apac
>>> >> he.nifi.provenance.CryptoUtilsTest)
>>> >> > Time elapsed: 0.052 sec  <<< FAILURE!
>>> >> > org.codehaus.groovy.runtime.powerassert.PowerAssertionError: assert
>>> >> > !unreadableKeyProviderIsValid
>>> >> >       ||
>>> >> >       |true
>>> >> >       false
>>> >> >    at
>>> >> > org.codehaus.groovy.runtime.InvokerHelper.assertFailed(Invok
>>> >> erHelper.java:402)
>>> >> >    at
>>> >> > org.codehaus.groovy.runtime.ScriptBytecodeAdapter.assertFail
>>> >> ed(ScriptBytecodeAdapter.java:650)
>>> >> >    at
>>> >> > org.apache.nifi.provenance.CryptoUtilsTest.testShouldNotVali
>>> >> dateUnreadableFileBasedKeyProvider(CryptoUtilsTest.groovy:214)
>>> >> > Results :
>>> >> > Failed tests:
>>> >> >  CryptoUtilsTest.testShouldNotValidateUnreadableFileBasedKeyP
>>> >> rovider:214
>>> >> > assert !unreadableKeyProviderIsValid
>>> >> >       ||
>>> >> >       |true
>>> >> >       false
>>> >> >
>>> >> > I'm running from a clean docker container from centos:latest.  I
>>> >> installed
>>> >> > openjdk-1.8.0-devel and maven 3.5.0 into the container.  The openjdk
>>> >> comes
>>> >> > with the crypto extensions, so I don't think this is the problem.
>>> >> >
>>> >> > Any thoughts on the above?
>>> >> >
>>> >> > By the way, the signatures and hashes look good.  However I don't see
>>> a
>>> >> > 1.3.0-RC1 tag, as per your email.
>>> >> >
>>> >> > Thanks,
>>> >> >
>>> >> > Adam
>>> >> >
>>> >> > p.s. here's more environment info:
>>> >> >
>>> >> > [root@0e3de1bf9bfc nifi-1.3.0]# mvn --version
>>> >> > Apache Maven 3.5.0 (ff8f5e7444045639af65f6095c62210b5713f426;
>>> >> > 2017-04-03T19:39:06Z)
>>> >> > Maven home: /opt/apache-maven-3.5.0
>>> >> > Java version: 1.8.0_131, vendor: Oracle Corporation
>>> >> > Java home: /usr/lib/jvm/java-1.8.0-openjdk-1.8.0.131-3.b12.el7_3.x86_
>>> >> 64/jre
>>> >> > Default locale: en_US, platform encoding: ANSI_X3.4-1968
>>> >> > OS name: "linux", version: "4.9.27-moby", arch: "amd64", family:
>>> "unix"
>>> >> > [root@0e3de1bf9bfc nifi-1.3.0]# uname -a
>>> >> > Linux 0e3de1bf9bfc 4.9.27-moby #1 SMP Thu May 11 04:01:18 UTC 2017
>>> >> x86_64
>>> >> > x86_64 x86_64 GNU/Linux
>>> >> > [root@0e3de1bf9bfc nifi-1.3.0]# cat /etc/redhat-release
>>> >> > CentOS Linux release 7.3.1611 (Core)
>>> >> >
>>> >> >
>>> >> >
>>> >> >
>>> >> >> On Mon, Jun 5, 2017 at 11:54 AM, Matt Gilman <[hidden email]>
>>> >> wrote:
>>> >> >>
>>> >> >> Hello,
>>> >> >>
>>> >> >>
>>> >> >> I am pleased to be calling this vote for the source release of Apache
>>> >> NiFi
>>> >> >> nifi-1.3.0.
>>> >> >>
>>> >> >>
>>> >> >> The source zip, including signatures, digests, etc. can be found at:
>>> >> >>
>>> >> >>
>>> https://repository.apache.org/content/repositories/orgapachenifi-1108
>>> >> >>
>>> >> >>
>>> >> >> The Git tag is nifi-1.3.0-RC1
>>> >> >>
>>> >> >> The Git commit ID is ddb73612bd1512d8b2151b81f9aa40811bca2aaa
>>> >> >>
>>> >> >> https://git-wip-us.apache.org/repos/asf?p=nifi.git;a=commit;h=
>>> >> >> ddb73612bd1512d8b2151b81f9aa40811bca2aaa
>>> >> >>
>>> >> >>
>>> >> >> Checksums of nifi-1.3.0-source-release.zip:
>>> >> >>
>>> >> >> MD5: 8b115682ac392342b9edff3bf0658ecb
>>> >> >>
>>> >> >> SHA1: f11cdebbabdc0d8f1f0dd4c5b880ded39d17f234
>>> >> >>
>>> >> >> SHA256: 9ba5565729d98c472c31a1fdbc44e9dc1eee87a2cf5184e8428743f75314
>>> >> 5b7f
>>> >> >>
>>> >> >>
>>> >> >> Release artifacts are signed with the following key:
>>> >> >>
>>> >> >> https://people.apache.org/keys/committer/mcgilman.asc
>>> >> >>
>>> >> >>
>>> >> >> KEYS file available here:
>>> >> >>
>>> >> >> https://dist.apache.org/repos/dist/release/nifi/KEYS
>>> >> >>
>>> >> >>
>>> >> >> 110 issues were closed/resolved for this release:
>>> >> >>
>>> >> >> https://issues.apache.org/jira/secure/ReleaseNote.jspa?
>>> >> >> projectId=12316020&version=12340498
>>> >> >>
>>> >> >>
>>> >> >> Release note highlights can be found here:
>>> >> >>
>>> >> >> https://cwiki.apache.org/confluence/display/NIFI/
>>> >> >> Release+Notes#ReleaseNotes-Version1.3.0
>>> >> >>
>>> >> >>
>>> >> >> The vote will be open for 72 hours.
>>> >> >>
>>> >> >> Please download the release candidate and evaluate the necessary
>>> items
>>> >> >> including checking hashes, signatures, build from source, and test.
>>> >> The
>>> >> >> please vote:
>>> >> >>
>>> >> >>
>>> >> >> [ ] +1 Release this package as nifi-1.3.0
>>> >> >>
>>> >> >> [ ] +0 no opinion
>>> >> >>
>>> >> >> [ ] -1 Do not release this package because...
>>> >> >>
>>> >>
>>> >
>>> >
>>>
Reply | Threaded
Open this post in threaded view
|

Re: [VOTE] Release Apache NiFi 1.3.0

Andy LoPresto-2
+1 (binding)

I downloaded the artifacts, verified the signature and hashes, built the app (with all tests and contrib-check passing), and ran it with a flow that worked in 1.2.0 performing scripted record lookups using a controller service. At first this failed because the API has changed, so that is something people upgrading should be aware of. However, after I updated my Groovy script to use the new API, everything worked fine. 

I then stopped the app, cleared the provenance repository, and configured it to use an encrypted provenance repository. After restarting and running, I was able to successfully query provenance data and visual examination of the raw repository files confirmed the data was properly encrypted. 

Andy LoPresto
PGP Fingerprint: 70EC B3E5 98A6 5A3F D3C4  BACE 3C6E F65B 2F7D EF69

On Jun 5, 2017, at 7:13 PM, Koji Kawamura <[hidden email]> wrote:

Filed https://issues.apache.org/jira/browse/NIFI-4021
And PullRequest https://github.com/apache/nifi/pull/1892

On Tue, Jun 6, 2017 at 10:54 AM, Koji Kawamura <[hidden email]> wrote:
Hi Adam, Jeff,

StandardFlowSynchronizerSpec relies on System.property so it can pass
if other test sets 'nifi.properties.file.path'.
I think I found how to fix the test class. I will create a JIRA and
send a PR for it.

Thanks,
Koji

On Tue, Jun 6, 2017 at 9:35 AM, Jeff <[hidden email]> wrote:
Hi Adam,

StandardFlowSynchronizerSpec via command line maven on my MBP passes
successfully, but I do see the same errors as you when running the tests
for StandardFlowSynchronizerSpec through IntelliJ.

On Mon, Jun 5, 2017 at 6:56 PM Adam Taft <[hidden email]> wrote:

Got past the first error, thanks Joey.  Indeed, the non-root user was the
fix.

Unfortunately, now I'm getting another test failure.  Can anyone confirm
this one?

Running org.apache.nifi.controller.StandardFlowSynchronizerSpec
Tests run: 4, Failures: 0, Errors: 4, Skipped: 0, Time elapsed: 0.677 sec
<<< FAILURE! - in org.apache.nifi.controller.StandardFlowSynchronizerSpec
scaling of /conf/scale-positions-flow-0.7.0.xml with encoding version
"null"(org.apache.nifi.controller.StandardFlowSynchronizerSpec)  Time
elapsed: 0.485 sec  <<< ERROR!
java.lang.NullPointerException: null
   at

org.apache.nifi.controller.StandardFlowSynchronizer.readFlowFromDisk(StandardFlowSynchronizer.java:558)
   at

org.apache.nifi.controller.StandardFlowSynchronizer.sync(StandardFlowSynchronizer.java:176)
   at org.apache.nifi.controller.StandardFlowSynchronizerSpec.scaling of
#filename with encoding version
"#flowEncodingVersion"(StandardFlowSynchronizerSpec.groovy:83)

scaling of /conf/scale-positions-flow-0.7.0.xml with encoding version
"0.7"(org.apache.nifi.controller.StandardFlowSynchronizerSpec)  Time
elapsed: 0.047 sec  <<< ERROR!
java.lang.NullPointerException: null
   at

org.apache.nifi.controller.StandardFlowSynchronizer.readFlowFromDisk(StandardFlowSynchronizer.java:558)
   at

org.apache.nifi.controller.StandardFlowSynchronizer.sync(StandardFlowSynchronizer.java:176)
   at org.apache.nifi.controller.StandardFlowSynchronizerSpec.scaling of
#filename with encoding version
"#flowEncodingVersion"(StandardFlowSynchronizerSpec.groovy:83)

scaling of /conf/scale-positions-flow-0.7.0.xml with encoding version
"1.0"(org.apache.nifi.controller.StandardFlowSynchronizerSpec)  Time
elapsed: 0.036 sec  <<< ERROR!
java.lang.NullPointerException: null
   at

org.apache.nifi.controller.StandardFlowSynchronizer.readFlowFromDisk(StandardFlowSynchronizer.java:558)
   at

org.apache.nifi.controller.StandardFlowSynchronizer.sync(StandardFlowSynchronizer.java:176)
   at org.apache.nifi.controller.StandardFlowSynchronizerSpec.scaling of
#filename with encoding version
"#flowEncodingVersion"(StandardFlowSynchronizerSpec.groovy:83)

scaling of /conf/scale-positions-flow-0.7.0.xml with encoding version
"99.0"(org.apache.nifi.controller.StandardFlowSynchronizerSpec)  Time
elapsed: 0.037 sec  <<< ERROR!
java.lang.NullPointerException: null
   at

org.apache.nifi.controller.StandardFlowSynchronizer.readFlowFromDisk(StandardFlowSynchronizer.java:558)
   at

org.apache.nifi.controller.StandardFlowSynchronizer.sync(StandardFlowSynchronizer.java:176)
   at org.apache.nifi.controller.StandardFlowSynchronizerSpec.scaling of
#filename with encoding version
"#flowEncodingVersion"(StandardFlowSynchronizerSpec.groovy:83)

Results :
Tests in error:
 StandardFlowSynchronizerSpec.scaling of #filename with encoding version
"#flowEncodingVersion":83 ? NullPointer
 StandardFlowSynchronizerSpec.scaling of #filename with encoding version
"#flowEncodingVersion":83 ? NullPointer
 StandardFlowSynchronizerSpec.scaling of #filename with encoding version
"#flowEncodingVersion":83 ? NullPointer
 StandardFlowSynchronizerSpec.scaling of #filename with encoding version
"#flowEncodingVersion":83 ? NullPointer






On Mon, Jun 5, 2017 at 4:18 PM, Adam Taft <[hidden email]> wrote:

OK, will check out root/non-root.  Thanks for the heads up on that.  Give
me a minute, will check with a non-root user.

Adam


On Mon, Jun 5, 2017 at 4:12 PM, Joey Frazee <[hidden email]>
wrote:

Adam, this can happen if you're building as root (E.g., if you're being
lazy like me and just using a disposable Docker container).

NIFI-3836 is open for it.

If this is what it is, just build as a non root user.

On Jun 5, 2017, at 5:25 PM, Adam Taft <[hidden email]> wrote:

I'm getting a test failure for this RC.  Here is the maven snippet.

-------------------------------------------------------
T E S T S
-------------------------------------------------------
Running org.apache.nifi.provenance.CryptoUtilsTest
Tests run: 16, Failures: 1, Errors: 0, Skipped: 0, Time elapsed: 0.761
sec
<<< FAILURE! - in org.apache.nifi.provenance.CryptoUtilsTest
testShouldNotValidateUnreadableFileBasedKeyProvider(org.apac
he.nifi.provenance.CryptoUtilsTest)
Time elapsed: 0.052 sec  <<< FAILURE!
org.codehaus.groovy.runtime.powerassert.PowerAssertionError: assert
!unreadableKeyProviderIsValid
     ||
     |true
     false
  at
org.codehaus.groovy.runtime.InvokerHelper.assertFailed(Invok
erHelper.java:402)
  at
org.codehaus.groovy.runtime.ScriptBytecodeAdapter.assertFail
ed(ScriptBytecodeAdapter.java:650)
  at
org.apache.nifi.provenance.CryptoUtilsTest.testShouldNotVali
dateUnreadableFileBasedKeyProvider(CryptoUtilsTest.groovy:214)
Results :
Failed tests:
CryptoUtilsTest.testShouldNotValidateUnreadableFileBasedKeyP
rovider:214
assert !unreadableKeyProviderIsValid
     ||
     |true
     false

I'm running from a clean docker container from centos:latest.  I
installed
openjdk-1.8.0-devel and maven 3.5.0 into the container.  The openjdk
comes
with the crypto extensions, so I don't think this is the problem.

Any thoughts on the above?

By the way, the signatures and hashes look good.  However I don't see
a
1.3.0-RC1 tag, as per your email.

Thanks,

Adam

p.s. here's more environment info:

[root@0e3de1bf9bfc nifi-1.3.0]# mvn --version
Apache Maven 3.5.0 (ff8f5e7444045639af65f6095c62210b5713f426;
2017-04-03T19:39:06Z)
Maven home: /opt/apache-maven-3.5.0
Java version: 1.8.0_131, vendor: Oracle Corporation
Java home: /usr/lib/jvm/java-1.8.0-openjdk-1.8.0.131-3.b12.el7_3.x86_
64/jre
Default locale: en_US, platform encoding: ANSI_X3.4-1968
OS name: "linux", version: "4.9.27-moby", arch: "amd64", family:
"unix"
[root@0e3de1bf9bfc nifi-1.3.0]# uname -a
Linux 0e3de1bf9bfc 4.9.27-moby #1 SMP Thu May 11 04:01:18 UTC 2017
x86_64
x86_64 x86_64 GNU/Linux
[root@0e3de1bf9bfc nifi-1.3.0]# cat /etc/redhat-release
CentOS Linux release 7.3.1611 (Core)




On Mon, Jun 5, 2017 at 11:54 AM, Matt Gilman <[hidden email]>
wrote:

Hello,


I am pleased to be calling this vote for the source release of Apache
NiFi
nifi-1.3.0.


The source zip, including signatures, digests, etc. can be found at:


https://repository.apache.org/content/repositories/orgapachenifi-1108


The Git tag is nifi-1.3.0-RC1

The Git commit ID is ddb73612bd1512d8b2151b81f9aa40811bca2aaa

https://git-wip-us.apache.org/repos/asf?p=nifi.git;a=commit;h=
ddb73612bd1512d8b2151b81f9aa40811bca2aaa


Checksums of nifi-1.3.0-source-release.zip:

MD5: 8b115682ac392342b9edff3bf0658ecb

SHA1: f11cdebbabdc0d8f1f0dd4c5b880ded39d17f234

SHA256: 9ba5565729d98c472c31a1fdbc44e9dc1eee87a2cf5184e8428743f75314
5b7f


Release artifacts are signed with the following key:

https://people.apache.org/keys/committer/mcgilman.asc


KEYS file available here:

https://dist.apache.org/repos/dist/release/nifi/KEYS


110 issues were closed/resolved for this release:

https://issues.apache.org/jira/secure/ReleaseNote.jspa?
projectId=12316020&version=12340498


Release note highlights can be found here:

https://cwiki.apache.org/confluence/display/NIFI/
Release+Notes#ReleaseNotes-Version1.3.0


The vote will be open for 72 hours.

Please download the release candidate and evaluate the necessary
items
including checking hashes, signatures, build from source, and test.
The
please vote:


[ ] +1 Release this package as nifi-1.3.0

[ ] +0 no opinion

[ ] -1 Do not release this package because...







signature.asc (859 bytes) Download Attachment
Reply | Threaded
Open this post in threaded view
|

Re: [VOTE] Release Apache NiFi 1.3.0

Andy LoPresto-2
I was incorrect in my notes below: the lookup was only introduced post-1.2.0. I meant that the imported flow worked in an earlier version of 1.3.0-SNAPSHOT and I had to make adjustments to be compatible with the release candidate. There is no concern for people upgrading from 1.2.0. 

Andy LoPresto
PGP Fingerprint: 70EC B3E5 98A6 5A3F D3C4  BACE 3C6E F65B 2F7D EF69

On Jun 5, 2017, at 8:23 PM, Andy LoPresto <[hidden email]> wrote:

+1 (binding)

I downloaded the artifacts, verified the signature and hashes, built the app (with all tests and contrib-check passing), and ran it with a flow that worked in 1.2.0 performing scripted record lookups using a controller service. At first this failed because the API has changed, so that is something people upgrading should be aware of. However, after I updated my Groovy script to use the new API, everything worked fine. 

I then stopped the app, cleared the provenance repository, and configured it to use an encrypted provenance repository. After restarting and running, I was able to successfully query provenance data and visual examination of the raw repository files confirmed the data was properly encrypted. 

Andy LoPresto
PGP Fingerprint: 70EC B3E5 98A6 5A3F D3C4  BACE 3C6E F65B 2F7D EF69

On Jun 5, 2017, at 7:13 PM, Koji Kawamura <[hidden email]> wrote:

Filed https://issues.apache.org/jira/browse/NIFI-4021
And PullRequest https://github.com/apache/nifi/pull/1892

On Tue, Jun 6, 2017 at 10:54 AM, Koji Kawamura <[hidden email]> wrote:
Hi Adam, Jeff,

StandardFlowSynchronizerSpec relies on System.property so it can pass
if other test sets 'nifi.properties.file.path'.
I think I found how to fix the test class. I will create a JIRA and
send a PR for it.

Thanks,
Koji

On Tue, Jun 6, 2017 at 9:35 AM, Jeff <[hidden email]> wrote:
Hi Adam,

StandardFlowSynchronizerSpec via command line maven on my MBP passes
successfully, but I do see the same errors as you when running the tests
for StandardFlowSynchronizerSpec through IntelliJ.

On Mon, Jun 5, 2017 at 6:56 PM Adam Taft <[hidden email]> wrote:

Got past the first error, thanks Joey.  Indeed, the non-root user was the
fix.

Unfortunately, now I'm getting another test failure.  Can anyone confirm
this one?

Running org.apache.nifi.controller.StandardFlowSynchronizerSpec
Tests run: 4, Failures: 0, Errors: 4, Skipped: 0, Time elapsed: 0.677 sec
<<< FAILURE! - in org.apache.nifi.controller.StandardFlowSynchronizerSpec
scaling of /conf/scale-positions-flow-0.7.0.xml with encoding version
"null"(org.apache.nifi.controller.StandardFlowSynchronizerSpec)  Time
elapsed: 0.485 sec  <<< ERROR!
java.lang.NullPointerException: null
   at

org.apache.nifi.controller.StandardFlowSynchronizer.readFlowFromDisk(StandardFlowSynchronizer.java:558)
   at

org.apache.nifi.controller.StandardFlowSynchronizer.sync(StandardFlowSynchronizer.java:176)
   at org.apache.nifi.controller.StandardFlowSynchronizerSpec.scaling of
#filename with encoding version
"#flowEncodingVersion"(StandardFlowSynchronizerSpec.groovy:83)

scaling of /conf/scale-positions-flow-0.7.0.xml with encoding version
"0.7"(org.apache.nifi.controller.StandardFlowSynchronizerSpec)  Time
elapsed: 0.047 sec  <<< ERROR!
java.lang.NullPointerException: null
   at

org.apache.nifi.controller.StandardFlowSynchronizer.readFlowFromDisk(StandardFlowSynchronizer.java:558)
   at

org.apache.nifi.controller.StandardFlowSynchronizer.sync(StandardFlowSynchronizer.java:176)
   at org.apache.nifi.controller.StandardFlowSynchronizerSpec.scaling of
#filename with encoding version
"#flowEncodingVersion"(StandardFlowSynchronizerSpec.groovy:83)

scaling of /conf/scale-positions-flow-0.7.0.xml with encoding version
"1.0"(org.apache.nifi.controller.StandardFlowSynchronizerSpec)  Time
elapsed: 0.036 sec  <<< ERROR!
java.lang.NullPointerException: null
   at

org.apache.nifi.controller.StandardFlowSynchronizer.readFlowFromDisk(StandardFlowSynchronizer.java:558)
   at

org.apache.nifi.controller.StandardFlowSynchronizer.sync(StandardFlowSynchronizer.java:176)
   at org.apache.nifi.controller.StandardFlowSynchronizerSpec.scaling of
#filename with encoding version
"#flowEncodingVersion"(StandardFlowSynchronizerSpec.groovy:83)

scaling of /conf/scale-positions-flow-0.7.0.xml with encoding version
"99.0"(org.apache.nifi.controller.StandardFlowSynchronizerSpec)  Time
elapsed: 0.037 sec  <<< ERROR!
java.lang.NullPointerException: null
   at

org.apache.nifi.controller.StandardFlowSynchronizer.readFlowFromDisk(StandardFlowSynchronizer.java:558)
   at

org.apache.nifi.controller.StandardFlowSynchronizer.sync(StandardFlowSynchronizer.java:176)
   at org.apache.nifi.controller.StandardFlowSynchronizerSpec.scaling of
#filename with encoding version
"#flowEncodingVersion"(StandardFlowSynchronizerSpec.groovy:83)

Results :
Tests in error:
 StandardFlowSynchronizerSpec.scaling of #filename with encoding version
"#flowEncodingVersion":83 ? NullPointer
 StandardFlowSynchronizerSpec.scaling of #filename with encoding version
"#flowEncodingVersion":83 ? NullPointer
 StandardFlowSynchronizerSpec.scaling of #filename with encoding version
"#flowEncodingVersion":83 ? NullPointer
 StandardFlowSynchronizerSpec.scaling of #filename with encoding version
"#flowEncodingVersion":83 ? NullPointer






On Mon, Jun 5, 2017 at 4:18 PM, Adam Taft <[hidden email]> wrote:

OK, will check out root/non-root.  Thanks for the heads up on that.  Give
me a minute, will check with a non-root user.

Adam


On Mon, Jun 5, 2017 at 4:12 PM, Joey Frazee <[hidden email]>
wrote:

Adam, this can happen if you're building as root (E.g., if you're being
lazy like me and just using a disposable Docker container).

NIFI-3836 is open for it.

If this is what it is, just build as a non root user.

On Jun 5, 2017, at 5:25 PM, Adam Taft <[hidden email]> wrote:

I'm getting a test failure for this RC.  Here is the maven snippet.

-------------------------------------------------------
T E S T S
-------------------------------------------------------
Running org.apache.nifi.provenance.CryptoUtilsTest
Tests run: 16, Failures: 1, Errors: 0, Skipped: 0, Time elapsed: 0.761
sec
<<< FAILURE! - in org.apache.nifi.provenance.CryptoUtilsTest
testShouldNotValidateUnreadableFileBasedKeyProvider(org.apac
he.nifi.provenance.CryptoUtilsTest)
Time elapsed: 0.052 sec  <<< FAILURE!
org.codehaus.groovy.runtime.powerassert.PowerAssertionError: assert
!unreadableKeyProviderIsValid
     ||
     |true
     false
  at
org.codehaus.groovy.runtime.InvokerHelper.assertFailed(Invok
erHelper.java:402)
  at
org.codehaus.groovy.runtime.ScriptBytecodeAdapter.assertFail
ed(ScriptBytecodeAdapter.java:650)
  at
org.apache.nifi.provenance.CryptoUtilsTest.testShouldNotVali
dateUnreadableFileBasedKeyProvider(CryptoUtilsTest.groovy:214)
Results :
Failed tests:
CryptoUtilsTest.testShouldNotValidateUnreadableFileBasedKeyP
rovider:214
assert !unreadableKeyProviderIsValid
     ||
     |true
     false

I'm running from a clean docker container from centos:latest.  I
installed
openjdk-1.8.0-devel and maven 3.5.0 into the container.  The openjdk
comes
with the crypto extensions, so I don't think this is the problem.

Any thoughts on the above?

By the way, the signatures and hashes look good.  However I don't see
a
1.3.0-RC1 tag, as per your email.

Thanks,

Adam

p.s. here's more environment info:

[root@0e3de1bf9bfc nifi-1.3.0]# mvn --version
Apache Maven 3.5.0 (ff8f5e7444045639af65f6095c62210b5713f426;
2017-04-03T19:39:06Z)
Maven home: /opt/apache-maven-3.5.0
Java version: 1.8.0_131, vendor: Oracle Corporation
Java home: /usr/lib/jvm/java-1.8.0-openjdk-1.8.0.131-3.b12.el7_3.x86_
64/jre
Default locale: en_US, platform encoding: ANSI_X3.4-1968
OS name: "linux", version: "4.9.27-moby", arch: "amd64", family:
"unix"
[root@0e3de1bf9bfc nifi-1.3.0]# uname -a
Linux 0e3de1bf9bfc 4.9.27-moby #1 SMP Thu May 11 04:01:18 UTC 2017
x86_64
x86_64 x86_64 GNU/Linux
[root@0e3de1bf9bfc nifi-1.3.0]# cat /etc/redhat-release
CentOS Linux release 7.3.1611 (Core)




On Mon, Jun 5, 2017 at 11:54 AM, Matt Gilman <[hidden email]>
wrote:

Hello,


I am pleased to be calling this vote for the source release of Apache
NiFi
nifi-1.3.0.


The source zip, including signatures, digests, etc. can be found at:


https://repository.apache.org/content/repositories/orgapachenifi-1108


The Git tag is nifi-1.3.0-RC1

The Git commit ID is ddb73612bd1512d8b2151b81f9aa40811bca2aaa

https://git-wip-us.apache.org/repos/asf?p=nifi.git;a=commit;h=
ddb73612bd1512d8b2151b81f9aa40811bca2aaa


Checksums of nifi-1.3.0-source-release.zip:

MD5: 8b115682ac392342b9edff3bf0658ecb

SHA1: f11cdebbabdc0d8f1f0dd4c5b880ded39d17f234

SHA256: 9ba5565729d98c472c31a1fdbc44e9dc1eee87a2cf5184e8428743f75314
5b7f


Release artifacts are signed with the following key:

https://people.apache.org/keys/committer/mcgilman.asc


KEYS file available here:

https://dist.apache.org/repos/dist/release/nifi/KEYS


110 issues were closed/resolved for this release:

https://issues.apache.org/jira/secure/ReleaseNote.jspa?
projectId=12316020&version=12340498


Release note highlights can be found here:

https://cwiki.apache.org/confluence/display/NIFI/
Release+Notes#ReleaseNotes-Version1.3.0


The vote will be open for 72 hours.

Please download the release candidate and evaluate the necessary
items
including checking hashes, signatures, build from source, and test.
The
please vote:


[ ] +1 Release this package as nifi-1.3.0

[ ] +0 no opinion

[ ] -1 Do not release this package because...








signature.asc (859 bytes) Download Attachment
Reply | Threaded
Open this post in threaded view
|

Re: [VOTE] Release Apache NiFi 1.3.0

Joe Witt
+1 (binding)

Full build w/contrib check passes.  All hashes, signature, commit hash
looks good.  Binary and source L&N checks out. Manually testing was
favorable.  Did find trouble when opting in to the new provenance
writeahead repo and filed [1].

[1] https://issues.apache.org/jira/browse/NIFI-4023

Thanks!  This release has some really powerful stuff packed into and a
lot of excellent bug fixes.

On Tue, Jun 6, 2017 at 12:03 AM, Andy LoPresto <[hidden email]> wrote:

> I was incorrect in my notes below: the lookup was only introduced
> post-1.2.0. I meant that the imported flow worked in an earlier version of
> 1.3.0-SNAPSHOT and I had to make adjustments to be compatible with the
> release candidate. There is no concern for people upgrading from 1.2.0.
>
> Andy LoPresto
> [hidden email]
> [hidden email]
> PGP Fingerprint: 70EC B3E5 98A6 5A3F D3C4  BACE 3C6E F65B 2F7D EF69
>
> On Jun 5, 2017, at 8:23 PM, Andy LoPresto <[hidden email]> wrote:
>
> +1 (binding)
>
> I downloaded the artifacts, verified the signature and hashes, built the app
> (with all tests and contrib-check passing), and ran it with a flow that
> worked in 1.2.0 performing scripted record lookups using a controller
> service. At first this failed because the API has changed, so that is
> something people upgrading should be aware of. However, after I updated my
> Groovy script to use the new API, everything worked fine.
>
> I then stopped the app, cleared the provenance repository, and configured it
> to use an encrypted provenance repository. After restarting and running, I
> was able to successfully query provenance data and visual examination of the
> raw repository files confirmed the data was properly encrypted.
>
> Andy LoPresto
> [hidden email]
> [hidden email]
> PGP Fingerprint: 70EC B3E5 98A6 5A3F D3C4  BACE 3C6E F65B 2F7D EF69
>
> On Jun 5, 2017, at 7:13 PM, Koji Kawamura <[hidden email]> wrote:
>
> Filed https://issues.apache.org/jira/browse/NIFI-4021
> And PullRequest https://github.com/apache/nifi/pull/1892
>
> On Tue, Jun 6, 2017 at 10:54 AM, Koji Kawamura <[hidden email]>
> wrote:
>
> Hi Adam, Jeff,
>
> StandardFlowSynchronizerSpec relies on System.property so it can pass
> if other test sets 'nifi.properties.file.path'.
> I think I found how to fix the test class. I will create a JIRA and
> send a PR for it.
>
> Thanks,
> Koji
>
> On Tue, Jun 6, 2017 at 9:35 AM, Jeff <[hidden email]> wrote:
>
> Hi Adam,
>
> StandardFlowSynchronizerSpec via command line maven on my MBP passes
> successfully, but I do see the same errors as you when running the tests
> for StandardFlowSynchronizerSpec through IntelliJ.
>
> On Mon, Jun 5, 2017 at 6:56 PM Adam Taft <[hidden email]> wrote:
>
> Got past the first error, thanks Joey.  Indeed, the non-root user was the
> fix.
>
> Unfortunately, now I'm getting another test failure.  Can anyone confirm
> this one?
>
> Running org.apache.nifi.controller.StandardFlowSynchronizerSpec
> Tests run: 4, Failures: 0, Errors: 4, Skipped: 0, Time elapsed: 0.677 sec
> <<< FAILURE! - in org.apache.nifi.controller.StandardFlowSynchronizerSpec
> scaling of /conf/scale-positions-flow-0.7.0.xml with encoding version
> "null"(org.apache.nifi.controller.StandardFlowSynchronizerSpec)  Time
> elapsed: 0.485 sec  <<< ERROR!
> java.lang.NullPointerException: null
>    at
>
> org.apache.nifi.controller.StandardFlowSynchronizer.readFlowFromDisk(StandardFlowSynchronizer.java:558)
>    at
>
> org.apache.nifi.controller.StandardFlowSynchronizer.sync(StandardFlowSynchronizer.java:176)
>    at org.apache.nifi.controller.StandardFlowSynchronizerSpec.scaling of
> #filename with encoding version
> "#flowEncodingVersion"(StandardFlowSynchronizerSpec.groovy:83)
>
> scaling of /conf/scale-positions-flow-0.7.0.xml with encoding version
> "0.7"(org.apache.nifi.controller.StandardFlowSynchronizerSpec)  Time
> elapsed: 0.047 sec  <<< ERROR!
> java.lang.NullPointerException: null
>    at
>
> org.apache.nifi.controller.StandardFlowSynchronizer.readFlowFromDisk(StandardFlowSynchronizer.java:558)
>    at
>
> org.apache.nifi.controller.StandardFlowSynchronizer.sync(StandardFlowSynchronizer.java:176)
>    at org.apache.nifi.controller.StandardFlowSynchronizerSpec.scaling of
> #filename with encoding version
> "#flowEncodingVersion"(StandardFlowSynchronizerSpec.groovy:83)
>
> scaling of /conf/scale-positions-flow-0.7.0.xml with encoding version
> "1.0"(org.apache.nifi.controller.StandardFlowSynchronizerSpec)  Time
> elapsed: 0.036 sec  <<< ERROR!
> java.lang.NullPointerException: null
>    at
>
> org.apache.nifi.controller.StandardFlowSynchronizer.readFlowFromDisk(StandardFlowSynchronizer.java:558)
>    at
>
> org.apache.nifi.controller.StandardFlowSynchronizer.sync(StandardFlowSynchronizer.java:176)
>    at org.apache.nifi.controller.StandardFlowSynchronizerSpec.scaling of
> #filename with encoding version
> "#flowEncodingVersion"(StandardFlowSynchronizerSpec.groovy:83)
>
> scaling of /conf/scale-positions-flow-0.7.0.xml with encoding version
> "99.0"(org.apache.nifi.controller.StandardFlowSynchronizerSpec)  Time
> elapsed: 0.037 sec  <<< ERROR!
> java.lang.NullPointerException: null
>    at
>
> org.apache.nifi.controller.StandardFlowSynchronizer.readFlowFromDisk(StandardFlowSynchronizer.java:558)
>    at
>
> org.apache.nifi.controller.StandardFlowSynchronizer.sync(StandardFlowSynchronizer.java:176)
>    at org.apache.nifi.controller.StandardFlowSynchronizerSpec.scaling of
> #filename with encoding version
> "#flowEncodingVersion"(StandardFlowSynchronizerSpec.groovy:83)
>
> Results :
> Tests in error:
>  StandardFlowSynchronizerSpec.scaling of #filename with encoding version
> "#flowEncodingVersion":83 ? NullPointer
>  StandardFlowSynchronizerSpec.scaling of #filename with encoding version
> "#flowEncodingVersion":83 ? NullPointer
>  StandardFlowSynchronizerSpec.scaling of #filename with encoding version
> "#flowEncodingVersion":83 ? NullPointer
>  StandardFlowSynchronizerSpec.scaling of #filename with encoding version
> "#flowEncodingVersion":83 ? NullPointer
>
>
>
>
>
>
> On Mon, Jun 5, 2017 at 4:18 PM, Adam Taft <[hidden email]> wrote:
>
> OK, will check out root/non-root.  Thanks for the heads up on that.  Give
> me a minute, will check with a non-root user.
>
> Adam
>
>
> On Mon, Jun 5, 2017 at 4:12 PM, Joey Frazee <[hidden email]>
> wrote:
>
> Adam, this can happen if you're building as root (E.g., if you're being
> lazy like me and just using a disposable Docker container).
>
> NIFI-3836 is open for it.
>
> If this is what it is, just build as a non root user.
>
> On Jun 5, 2017, at 5:25 PM, Adam Taft <[hidden email]> wrote:
>
> I'm getting a test failure for this RC.  Here is the maven snippet.
>
> -------------------------------------------------------
> T E S T S
> -------------------------------------------------------
> Running org.apache.nifi.provenance.CryptoUtilsTest
> Tests run: 16, Failures: 1, Errors: 0, Skipped: 0, Time elapsed: 0.761
>
> sec
>
> <<< FAILURE! - in org.apache.nifi.provenance.CryptoUtilsTest
> testShouldNotValidateUnreadableFileBasedKeyProvider(org.apac
>
> he.nifi.provenance.CryptoUtilsTest)
>
> Time elapsed: 0.052 sec  <<< FAILURE!
> org.codehaus.groovy.runtime.powerassert.PowerAssertionError: assert
> !unreadableKeyProviderIsValid
>      ||
>      |true
>      false
>   at
> org.codehaus.groovy.runtime.InvokerHelper.assertFailed(Invok
>
> erHelper.java:402)
>
>   at
> org.codehaus.groovy.runtime.ScriptBytecodeAdapter.assertFail
>
> ed(ScriptBytecodeAdapter.java:650)
>
>   at
> org.apache.nifi.provenance.CryptoUtilsTest.testShouldNotVali
>
> dateUnreadableFileBasedKeyProvider(CryptoUtilsTest.groovy:214)
>
> Results :
> Failed tests:
> CryptoUtilsTest.testShouldNotValidateUnreadableFileBasedKeyP
>
> rovider:214
>
> assert !unreadableKeyProviderIsValid
>      ||
>      |true
>      false
>
> I'm running from a clean docker container from centos:latest.  I
>
> installed
>
> openjdk-1.8.0-devel and maven 3.5.0 into the container.  The openjdk
>
> comes
>
> with the crypto extensions, so I don't think this is the problem.
>
> Any thoughts on the above?
>
> By the way, the signatures and hashes look good.  However I don't see
>
> a
>
> 1.3.0-RC1 tag, as per your email.
>
> Thanks,
>
> Adam
>
> p.s. here's more environment info:
>
> [root@0e3de1bf9bfc nifi-1.3.0]# mvn --version
> Apache Maven 3.5.0 (ff8f5e7444045639af65f6095c62210b5713f426;
> 2017-04-03T19:39:06Z)
> Maven home: /opt/apache-maven-3.5.0
> Java version: 1.8.0_131, vendor: Oracle Corporation
> Java home: /usr/lib/jvm/java-1.8.0-openjdk-1.8.0.131-3.b12.el7_3.x86_
>
> 64/jre
>
> Default locale: en_US, platform encoding: ANSI_X3.4-1968
> OS name: "linux", version: "4.9.27-moby", arch: "amd64", family:
>
> "unix"
>
> [root@0e3de1bf9bfc nifi-1.3.0]# uname -a
> Linux 0e3de1bf9bfc 4.9.27-moby #1 SMP Thu May 11 04:01:18 UTC 2017
>
> x86_64
>
> x86_64 x86_64 GNU/Linux
> [root@0e3de1bf9bfc nifi-1.3.0]# cat /etc/redhat-release
> CentOS Linux release 7.3.1611 (Core)
>
>
>
>
> On Mon, Jun 5, 2017 at 11:54 AM, Matt Gilman <[hidden email]>
>
> wrote:
>
>
> Hello,
>
>
> I am pleased to be calling this vote for the source release of Apache
>
> NiFi
>
> nifi-1.3.0.
>
>
> The source zip, including signatures, digests, etc. can be found at:
>
>
> https://repository.apache.org/content/repositories/orgapachenifi-1108
>
>
>
> The Git tag is nifi-1.3.0-RC1
>
> The Git commit ID is ddb73612bd1512d8b2151b81f9aa40811bca2aaa
>
> https://git-wip-us.apache.org/repos/asf?p=nifi.git;a=commit;h=
> ddb73612bd1512d8b2151b81f9aa40811bca2aaa
>
>
> Checksums of nifi-1.3.0-source-release.zip:
>
> MD5: 8b115682ac392342b9edff3bf0658ecb
>
> SHA1: f11cdebbabdc0d8f1f0dd4c5b880ded39d17f234
>
> SHA256: 9ba5565729d98c472c31a1fdbc44e9dc1eee87a2cf5184e8428743f75314
>
> 5b7f
>
>
>
> Release artifacts are signed with the following key:
>
> https://people.apache.org/keys/committer/mcgilman.asc
>
>
> KEYS file available here:
>
> https://dist.apache.org/repos/dist/release/nifi/KEYS
>
>
> 110 issues were closed/resolved for this release:
>
> https://issues.apache.org/jira/secure/ReleaseNote.jspa?
> projectId=12316020&version=12340498
>
>
> Release note highlights can be found here:
>
> https://cwiki.apache.org/confluence/display/NIFI/
> Release+Notes#ReleaseNotes-Version1.3.0
>
>
> The vote will be open for 72 hours.
>
> Please download the release candidate and evaluate the necessary
>
> items
>
> including checking hashes, signatures, build from source, and test.
>
> The
>
> please vote:
>
>
> [ ] +1 Release this package as nifi-1.3.0
>
> [ ] +0 no opinion
>
> [ ] -1 Do not release this package because...
>
>
>
>
>
>
>
Reply | Threaded
Open this post in threaded view
|

Re: [VOTE] Release Apache NiFi 1.3.0

James Wing
In reply to this post by Matt Gilman-2
+1 (binding).  I ran through the release helper -- verified signature and
hashes, ran the full build, checked readme, license, and notice in source
and output.  I ran a simple flow and verified that it still works.

Thanks for putting this release together, Matt.

James


On Mon, Jun 5, 2017 at 10:54 AM, Matt Gilman <[hidden email]> wrote:

> Hello,
>
>
> I am pleased to be calling this vote for the source release of Apache NiFi
> nifi-1.3.0.
>
>
> The source zip, including signatures, digests, etc. can be found at:
>
> https://repository.apache.org/content/repositories/orgapachenifi-1108
>
>
> The Git tag is nifi-1.3.0-RC1
>
> The Git commit ID is ddb73612bd1512d8b2151b81f9aa40811bca2aaa
>
> https://git-wip-us.apache.org/repos/asf?p=nifi.git;a=commit;h=
> ddb73612bd1512d8b2151b81f9aa40811bca2aaa
>
>
> Checksums of nifi-1.3.0-source-release.zip:
>
> MD5: 8b115682ac392342b9edff3bf0658ecb
>
> SHA1: f11cdebbabdc0d8f1f0dd4c5b880ded39d17f234
>
> SHA256: 9ba5565729d98c472c31a1fdbc44e9dc1eee87a2cf5184e8428743f753145b7f
>
>
> Release artifacts are signed with the following key:
>
> https://people.apache.org/keys/committer/mcgilman.asc
>
>
> KEYS file available here:
>
> https://dist.apache.org/repos/dist/release/nifi/KEYS
>
>
> 110 issues were closed/resolved for this release:
>
> https://issues.apache.org/jira/secure/ReleaseNote.jspa?
> projectId=12316020&version=12340498
>
>
> Release note highlights can be found here:
>
> https://cwiki.apache.org/confluence/display/NIFI/
> Release+Notes#ReleaseNotes-Version1.3.0
>
>
> The vote will be open for 72 hours.
>
> Please download the release candidate and evaluate the necessary items
> including checking hashes, signatures, build from source, and test.  The
> please vote:
>
>
> [ ] +1 Release this package as nifi-1.3.0
>
> [ ] +0 no opinion
>
> [ ] -1 Do not release this package because...
>
Reply | Threaded
Open this post in threaded view
|

Re: [VOTE] Release Apache NiFi 1.3.0

Bryan Bende
+1 (binding) Release this package as nifi-1.3.0

- Ran through release helper and everything checked out
- Ran some test flows with HDFS processors and verified they worked correctly

On Tue, Jun 6, 2017 at 12:42 AM, James Wing <[hidden email]> wrote:

> +1 (binding).  I ran through the release helper -- verified signature and
> hashes, ran the full build, checked readme, license, and notice in source
> and output.  I ran a simple flow and verified that it still works.
>
> Thanks for putting this release together, Matt.
>
> James
>
>
> On Mon, Jun 5, 2017 at 10:54 AM, Matt Gilman <[hidden email]> wrote:
>
>> Hello,
>>
>>
>> I am pleased to be calling this vote for the source release of Apache NiFi
>> nifi-1.3.0.
>>
>>
>> The source zip, including signatures, digests, etc. can be found at:
>>
>> https://repository.apache.org/content/repositories/orgapachenifi-1108
>>
>>
>> The Git tag is nifi-1.3.0-RC1
>>
>> The Git commit ID is ddb73612bd1512d8b2151b81f9aa40811bca2aaa
>>
>> https://git-wip-us.apache.org/repos/asf?p=nifi.git;a=commit;h=
>> ddb73612bd1512d8b2151b81f9aa40811bca2aaa
>>
>>
>> Checksums of nifi-1.3.0-source-release.zip:
>>
>> MD5: 8b115682ac392342b9edff3bf0658ecb
>>
>> SHA1: f11cdebbabdc0d8f1f0dd4c5b880ded39d17f234
>>
>> SHA256: 9ba5565729d98c472c31a1fdbc44e9dc1eee87a2cf5184e8428743f753145b7f
>>
>>
>> Release artifacts are signed with the following key:
>>
>> https://people.apache.org/keys/committer/mcgilman.asc
>>
>>
>> KEYS file available here:
>>
>> https://dist.apache.org/repos/dist/release/nifi/KEYS
>>
>>
>> 110 issues were closed/resolved for this release:
>>
>> https://issues.apache.org/jira/secure/ReleaseNote.jspa?
>> projectId=12316020&version=12340498
>>
>>
>> Release note highlights can be found here:
>>
>> https://cwiki.apache.org/confluence/display/NIFI/
>> Release+Notes#ReleaseNotes-Version1.3.0
>>
>>
>> The vote will be open for 72 hours.
>>
>> Please download the release candidate and evaluate the necessary items
>> including checking hashes, signatures, build from source, and test.  The
>> please vote:
>>
>>
>> [ ] +1 Release this package as nifi-1.3.0
>>
>> [ ] +0 no opinion
>>
>> [ ] -1 Do not release this package because...
>>
Reply | Threaded
Open this post in threaded view
|

Re: [VOTE] Release Apache NiFi 1.3.0

Joe Skora
+1 (binding)

* Verified GPG signature.
* Verified hashes.
* Built source with contrib-check profile.
* Verified README, NOTICE, and LICENSE.
* Verified commit ID.
* Verified RC was branched from master.
* Ran binary and tested basic functionality.


On Tue, Jun 6, 2017 at 10:27 AM, Bryan Bende <[hidden email]> wrote:

> +1 (binding) Release this package as nifi-1.3.0
>
> - Ran through release helper and everything checked out
> - Ran some test flows with HDFS processors and verified they worked
> correctly
>
> On Tue, Jun 6, 2017 at 12:42 AM, James Wing <[hidden email]> wrote:
> > +1 (binding).  I ran through the release helper -- verified signature and
> > hashes, ran the full build, checked readme, license, and notice in source
> > and output.  I ran a simple flow and verified that it still works.
> >
> > Thanks for putting this release together, Matt.
> >
> > James
> >
> >
> > On Mon, Jun 5, 2017 at 10:54 AM, Matt Gilman <[hidden email]>
> wrote:
> >
> >> Hello,
> >>
> >>
> >> I am pleased to be calling this vote for the source release of Apache
> NiFi
> >> nifi-1.3.0.
> >>
> >>
> >> The source zip, including signatures, digests, etc. can be found at:
> >>
> >> https://repository.apache.org/content/repositories/orgapachenifi-1108
> >>
> >>
> >> The Git tag is nifi-1.3.0-RC1
> >>
> >> The Git commit ID is ddb73612bd1512d8b2151b81f9aa40811bca2aaa
> >>
> >> https://git-wip-us.apache.org/repos/asf?p=nifi.git;a=commit;h=
> >> ddb73612bd1512d8b2151b81f9aa40811bca2aaa
> >>
> >>
> >> Checksums of nifi-1.3.0-source-release.zip:
> >>
> >> MD5: 8b115682ac392342b9edff3bf0658ecb
> >>
> >> SHA1: f11cdebbabdc0d8f1f0dd4c5b880ded39d17f234
> >>
> >> SHA256: 9ba5565729d98c472c31a1fdbc44e9dc1eee87a2cf5184e8428743f75314
> 5b7f
> >>
> >>
> >> Release artifacts are signed with the following key:
> >>
> >> https://people.apache.org/keys/committer/mcgilman.asc
> >>
> >>
> >> KEYS file available here:
> >>
> >> https://dist.apache.org/repos/dist/release/nifi/KEYS
> >>
> >>
> >> 110 issues were closed/resolved for this release:
> >>
> >> https://issues.apache.org/jira/secure/ReleaseNote.jspa?
> >> projectId=12316020&version=12340498
> >>
> >>
> >> Release note highlights can be found here:
> >>
> >> https://cwiki.apache.org/confluence/display/NIFI/
> >> Release+Notes#ReleaseNotes-Version1.3.0
> >>
> >>
> >> The vote will be open for 72 hours.
> >>
> >> Please download the release candidate and evaluate the necessary items
> >> including checking hashes, signatures, build from source, and test.  The
> >> please vote:
> >>
> >>
> >> [ ] +1 Release this package as nifi-1.3.0
> >>
> >> [ ] +0 no opinion
> >>
> >> [ ] -1 Do not release this package because...
> >>
>
Reply | Threaded
Open this post in threaded view
|

Re: [VOTE] Release Apache NiFi 1.3.0

Scott Aslan
+1 (non-binding)

- Verified signatures, checksums, LICENSE, NOTICE, and README
- Built using a full clean build with contrib check successfully on OSX
- Run example data flows on OS X with Chrome Version 58.0.3029.110 (64-bit)
 on unsecured instance
- Run example data flows on OS X with Chrome Version 58.0.3029.110 (64-bit) on
secured instance

On Tue, Jun 6, 2017 at 12:44 PM, Joe Skora <[hidden email]> wrote:

> +1 (binding)
>
> * Verified GPG signature.
> * Verified hashes.
> * Built source with contrib-check profile.
> * Verified README, NOTICE, and LICENSE.
> * Verified commit ID.
> * Verified RC was branched from master.
> * Ran binary and tested basic functionality.
>
>
> On Tue, Jun 6, 2017 at 10:27 AM, Bryan Bende <[hidden email]> wrote:
>
> > +1 (binding) Release this package as nifi-1.3.0
> >
> > - Ran through release helper and everything checked out
> > - Ran some test flows with HDFS processors and verified they worked
> > correctly
> >
> > On Tue, Jun 6, 2017 at 12:42 AM, James Wing <[hidden email]> wrote:
> > > +1 (binding).  I ran through the release helper -- verified signature
> and
> > > hashes, ran the full build, checked readme, license, and notice in
> source
> > > and output.  I ran a simple flow and verified that it still works.
> > >
> > > Thanks for putting this release together, Matt.
> > >
> > > James
> > >
> > >
> > > On Mon, Jun 5, 2017 at 10:54 AM, Matt Gilman <[hidden email]>
> > wrote:
> > >
> > >> Hello,
> > >>
> > >>
> > >> I am pleased to be calling this vote for the source release of Apache
> > NiFi
> > >> nifi-1.3.0.
> > >>
> > >>
> > >> The source zip, including signatures, digests, etc. can be found at:
> > >>
> > >> https://repository.apache.org/content/repositories/orgapachenifi-1108
> > >>
> > >>
> > >> The Git tag is nifi-1.3.0-RC1
> > >>
> > >> The Git commit ID is ddb73612bd1512d8b2151b81f9aa40811bca2aaa
> > >>
> > >> https://git-wip-us.apache.org/repos/asf?p=nifi.git;a=commit;h=
> > >> ddb73612bd1512d8b2151b81f9aa40811bca2aaa
> > >>
> > >>
> > >> Checksums of nifi-1.3.0-source-release.zip:
> > >>
> > >> MD5: 8b115682ac392342b9edff3bf0658ecb
> > >>
> > >> SHA1: f11cdebbabdc0d8f1f0dd4c5b880ded39d17f234
> > >>
> > >> SHA256: 9ba5565729d98c472c31a1fdbc44e9dc1eee87a2cf5184e8428743f75314
> > 5b7f
> > >>
> > >>
> > >> Release artifacts are signed with the following key:
> > >>
> > >> https://people.apache.org/keys/committer/mcgilman.asc
> > >>
> > >>
> > >> KEYS file available here:
> > >>
> > >> https://dist.apache.org/repos/dist/release/nifi/KEYS
> > >>
> > >>
> > >> 110 issues were closed/resolved for this release:
> > >>
> > >> https://issues.apache.org/jira/secure/ReleaseNote.jspa?
> > >> projectId=12316020&version=12340498
> > >>
> > >>
> > >> Release note highlights can be found here:
> > >>
> > >> https://cwiki.apache.org/confluence/display/NIFI/
> > >> Release+Notes#ReleaseNotes-Version1.3.0
> > >>
> > >>
> > >> The vote will be open for 72 hours.
> > >>
> > >> Please download the release candidate and evaluate the necessary items
> > >> including checking hashes, signatures, build from source, and test.
> The
> > >> please vote:
> > >>
> > >>
> > >> [ ] +1 Release this package as nifi-1.3.0
> > >>
> > >> [ ] +0 no opinion
> > >>
> > >> [ ] -1 Do not release this package because...
> > >>
> >
>



--
*Scott Aslan = new WebDeveloper(*
*{    "location": {        "city": "Saint Cloud",        "state": "FL",
    "zip": "34771"    },    "contact": {        "email":
"[hidden email] <[hidden email]>",        "linkedin":
"http://www.linkedin.com/in/scottyaslan
<http://www.linkedin.com/in/scottaslan>"    }});*
Reply | Threaded
Open this post in threaded view
|

Re: [VOTE] Release Apache NiFi 1.3.0

Yolanda Davis
In reply to this post by Joe Skora
+1 (binding)

-ran through release helper, verified hashes, signatures, checked README,
LICENSE, NOTICE
-ran build and tested with flows using QueryRecord (RecordReaders/Writers
etc), worked as expected.

On Tue, Jun 6, 2017 at 12:44 PM, Joe Skora <[hidden email]> wrote:

> +1 (binding)
>
> * Verified GPG signature.
> * Verified hashes.
> * Built source with contrib-check profile.
> * Verified README, NOTICE, and LICENSE.
> * Verified commit ID.
> * Verified RC was branched from master.
> * Ran binary and tested basic functionality.
>
>
> On Tue, Jun 6, 2017 at 10:27 AM, Bryan Bende <[hidden email]> wrote:
>
> > +1 (binding) Release this package as nifi-1.3.0
> >
> > - Ran through release helper and everything checked out
> > - Ran some test flows with HDFS processors and verified they worked
> > correctly
> >
> > On Tue, Jun 6, 2017 at 12:42 AM, James Wing <[hidden email]> wrote:
> > > +1 (binding).  I ran through the release helper -- verified signature
> and
> > > hashes, ran the full build, checked readme, license, and notice in
> source
> > > and output.  I ran a simple flow and verified that it still works.
> > >
> > > Thanks for putting this release together, Matt.
> > >
> > > James
> > >
> > >
> > > On Mon, Jun 5, 2017 at 10:54 AM, Matt Gilman <[hidden email]>
> > wrote:
> > >
> > >> Hello,
> > >>
> > >>
> > >> I am pleased to be calling this vote for the source release of Apache
> > NiFi
> > >> nifi-1.3.0.
> > >>
> > >>
> > >> The source zip, including signatures, digests, etc. can be found at:
> > >>
> > >> https://repository.apache.org/content/repositories/orgapachenifi-1108
> > >>
> > >>
> > >> The Git tag is nifi-1.3.0-RC1
> > >>
> > >> The Git commit ID is ddb73612bd1512d8b2151b81f9aa40811bca2aaa
> > >>
> > >> https://git-wip-us.apache.org/repos/asf?p=nifi.git;a=commit;h=
> > >> ddb73612bd1512d8b2151b81f9aa40811bca2aaa
> > >>
> > >>
> > >> Checksums of nifi-1.3.0-source-release.zip:
> > >>
> > >> MD5: 8b115682ac392342b9edff3bf0658ecb
> > >>
> > >> SHA1: f11cdebbabdc0d8f1f0dd4c5b880ded39d17f234
> > >>
> > >> SHA256: 9ba5565729d98c472c31a1fdbc44e9dc1eee87a2cf5184e8428743f75314
> > 5b7f
> > >>
> > >>
> > >> Release artifacts are signed with the following key:
> > >>
> > >> https://people.apache.org/keys/committer/mcgilman.asc
> > >>
> > >>
> > >> KEYS file available here:
> > >>
> > >> https://dist.apache.org/repos/dist/release/nifi/KEYS
> > >>
> > >>
> > >> 110 issues were closed/resolved for this release:
> > >>
> > >> https://issues.apache.org/jira/secure/ReleaseNote.jspa?
> > >> projectId=12316020&version=12340498
> > >>
> > >>
> > >> Release note highlights can be found here:
> > >>
> > >> https://cwiki.apache.org/confluence/display/NIFI/
> > >> Release+Notes#ReleaseNotes-Version1.3.0
> > >>
> > >>
> > >> The vote will be open for 72 hours.
> > >>
> > >> Please download the release candidate and evaluate the necessary items
> > >> including checking hashes, signatures, build from source, and test.
> The
> > >> please vote:
> > >>
> > >>
> > >> [ ] +1 Release this package as nifi-1.3.0
> > >>
> > >> [ ] +0 no opinion
> > >>
> > >> [ ] -1 Do not release this package because...
> > >>
> >
>



--
--
[hidden email]
@YolandaMDavis
Reply | Threaded
Open this post in threaded view
|

Re: [VOTE] Release Apache NiFi 1.3.0

Pierre Villard
+1 (binding)

- verified signatures, checksums, license, notice and readme.
- full build on OSX, Windows 10, CentOS 7 (faced some test errors while
building on Windows but the failing tests have already opened JIRAs to
track them)
- checked UIs changes
- tested some workflows for Record based processors and SiteToSite
reporting tasks

Release this package as nifi-1.3.0


2017-06-06 18:55 GMT+02:00 Yolanda Davis <[hidden email]>:

> +1 (binding)
>
> -ran through release helper, verified hashes, signatures, checked README,
> LICENSE, NOTICE
> -ran build and tested with flows using QueryRecord (RecordReaders/Writers
> etc), worked as expected.
>
> On Tue, Jun 6, 2017 at 12:44 PM, Joe Skora <[hidden email]> wrote:
>
> > +1 (binding)
> >
> > * Verified GPG signature.
> > * Verified hashes.
> > * Built source with contrib-check profile.
> > * Verified README, NOTICE, and LICENSE.
> > * Verified commit ID.
> > * Verified RC was branched from master.
> > * Ran binary and tested basic functionality.
> >
> >
> > On Tue, Jun 6, 2017 at 10:27 AM, Bryan Bende <[hidden email]> wrote:
> >
> > > +1 (binding) Release this package as nifi-1.3.0
> > >
> > > - Ran through release helper and everything checked out
> > > - Ran some test flows with HDFS processors and verified they worked
> > > correctly
> > >
> > > On Tue, Jun 6, 2017 at 12:42 AM, James Wing <[hidden email]> wrote:
> > > > +1 (binding).  I ran through the release helper -- verified signature
> > and
> > > > hashes, ran the full build, checked readme, license, and notice in
> > source
> > > > and output.  I ran a simple flow and verified that it still works.
> > > >
> > > > Thanks for putting this release together, Matt.
> > > >
> > > > James
> > > >
> > > >
> > > > On Mon, Jun 5, 2017 at 10:54 AM, Matt Gilman <[hidden email]>
> > > wrote:
> > > >
> > > >> Hello,
> > > >>
> > > >>
> > > >> I am pleased to be calling this vote for the source release of
> Apache
> > > NiFi
> > > >> nifi-1.3.0.
> > > >>
> > > >>
> > > >> The source zip, including signatures, digests, etc. can be found at:
> > > >>
> > > >> https://repository.apache.org/content/repositories/
> orgapachenifi-1108
> > > >>
> > > >>
> > > >> The Git tag is nifi-1.3.0-RC1
> > > >>
> > > >> The Git commit ID is ddb73612bd1512d8b2151b81f9aa40811bca2aaa
> > > >>
> > > >> https://git-wip-us.apache.org/repos/asf?p=nifi.git;a=commit;h=
> > > >> ddb73612bd1512d8b2151b81f9aa40811bca2aaa
> > > >>
> > > >>
> > > >> Checksums of nifi-1.3.0-source-release.zip:
> > > >>
> > > >> MD5: 8b115682ac392342b9edff3bf0658ecb
> > > >>
> > > >> SHA1: f11cdebbabdc0d8f1f0dd4c5b880ded39d17f234
> > > >>
> > > >> SHA256: 9ba5565729d98c472c31a1fdbc44e9
> dc1eee87a2cf5184e8428743f75314
> > > 5b7f
> > > >>
> > > >>
> > > >> Release artifacts are signed with the following key:
> > > >>
> > > >> https://people.apache.org/keys/committer/mcgilman.asc
> > > >>
> > > >>
> > > >> KEYS file available here:
> > > >>
> > > >> https://dist.apache.org/repos/dist/release/nifi/KEYS
> > > >>
> > > >>
> > > >> 110 issues were closed/resolved for this release:
> > > >>
> > > >> https://issues.apache.org/jira/secure/ReleaseNote.jspa?
> > > >> projectId=12316020&version=12340498
> > > >>
> > > >>
> > > >> Release note highlights can be found here:
> > > >>
> > > >> https://cwiki.apache.org/confluence/display/NIFI/
> > > >> Release+Notes#ReleaseNotes-Version1.3.0
> > > >>
> > > >>
> > > >> The vote will be open for 72 hours.
> > > >>
> > > >> Please download the release candidate and evaluate the necessary
> items
> > > >> including checking hashes, signatures, build from source, and test.
> > The
> > > >> please vote:
> > > >>
> > > >>
> > > >> [ ] +1 Release this package as nifi-1.3.0
> > > >>
> > > >> [ ] +0 no opinion
> > > >>
> > > >> [ ] -1 Do not release this package because...
> > > >>
> > >
> >
>
>
>
> --
> --
> [hidden email]
> @YolandaMDavis
>
Reply | Threaded
Open this post in threaded view
|

Re: [VOTE] Release Apache NiFi 1.3.0

Koji Kawamura
+1 (binding)

- ran through release helper
- ran clean build, test passed without issue
- ran simple flow using standalone/non-secure/secure/clustered NiFi
- confirmed few JIRAs data flow those had been addressed within 1.3.0


On Wed, Jun 7, 2017 at 2:15 AM, Pierre Villard
<[hidden email]> wrote:

> +1 (binding)
>
> - verified signatures, checksums, license, notice and readme.
> - full build on OSX, Windows 10, CentOS 7 (faced some test errors while
> building on Windows but the failing tests have already opened JIRAs to
> track them)
> - checked UIs changes
> - tested some workflows for Record based processors and SiteToSite
> reporting tasks
>
> Release this package as nifi-1.3.0
>
>
> 2017-06-06 18:55 GMT+02:00 Yolanda Davis <[hidden email]>:
>
>> +1 (binding)
>>
>> -ran through release helper, verified hashes, signatures, checked README,
>> LICENSE, NOTICE
>> -ran build and tested with flows using QueryRecord (RecordReaders/Writers
>> etc), worked as expected.
>>
>> On Tue, Jun 6, 2017 at 12:44 PM, Joe Skora <[hidden email]> wrote:
>>
>> > +1 (binding)
>> >
>> > * Verified GPG signature.
>> > * Verified hashes.
>> > * Built source with contrib-check profile.
>> > * Verified README, NOTICE, and LICENSE.
>> > * Verified commit ID.
>> > * Verified RC was branched from master.
>> > * Ran binary and tested basic functionality.
>> >
>> >
>> > On Tue, Jun 6, 2017 at 10:27 AM, Bryan Bende <[hidden email]> wrote:
>> >
>> > > +1 (binding) Release this package as nifi-1.3.0
>> > >
>> > > - Ran through release helper and everything checked out
>> > > - Ran some test flows with HDFS processors and verified they worked
>> > > correctly
>> > >
>> > > On Tue, Jun 6, 2017 at 12:42 AM, James Wing <[hidden email]> wrote:
>> > > > +1 (binding).  I ran through the release helper -- verified signature
>> > and
>> > > > hashes, ran the full build, checked readme, license, and notice in
>> > source
>> > > > and output.  I ran a simple flow and verified that it still works.
>> > > >
>> > > > Thanks for putting this release together, Matt.
>> > > >
>> > > > James
>> > > >
>> > > >
>> > > > On Mon, Jun 5, 2017 at 10:54 AM, Matt Gilman <[hidden email]>
>> > > wrote:
>> > > >
>> > > >> Hello,
>> > > >>
>> > > >>
>> > > >> I am pleased to be calling this vote for the source release of
>> Apache
>> > > NiFi
>> > > >> nifi-1.3.0.
>> > > >>
>> > > >>
>> > > >> The source zip, including signatures, digests, etc. can be found at:
>> > > >>
>> > > >> https://repository.apache.org/content/repositories/
>> orgapachenifi-1108
>> > > >>
>> > > >>
>> > > >> The Git tag is nifi-1.3.0-RC1
>> > > >>
>> > > >> The Git commit ID is ddb73612bd1512d8b2151b81f9aa40811bca2aaa
>> > > >>
>> > > >> https://git-wip-us.apache.org/repos/asf?p=nifi.git;a=commit;h=
>> > > >> ddb73612bd1512d8b2151b81f9aa40811bca2aaa
>> > > >>
>> > > >>
>> > > >> Checksums of nifi-1.3.0-source-release.zip:
>> > > >>
>> > > >> MD5: 8b115682ac392342b9edff3bf0658ecb
>> > > >>
>> > > >> SHA1: f11cdebbabdc0d8f1f0dd4c5b880ded39d17f234
>> > > >>
>> > > >> SHA256: 9ba5565729d98c472c31a1fdbc44e9
>> dc1eee87a2cf5184e8428743f75314
>> > > 5b7f
>> > > >>
>> > > >>
>> > > >> Release artifacts are signed with the following key:
>> > > >>
>> > > >> https://people.apache.org/keys/committer/mcgilman.asc
>> > > >>
>> > > >>
>> > > >> KEYS file available here:
>> > > >>
>> > > >> https://dist.apache.org/repos/dist/release/nifi/KEYS
>> > > >>
>> > > >>
>> > > >> 110 issues were closed/resolved for this release:
>> > > >>
>> > > >> https://issues.apache.org/jira/secure/ReleaseNote.jspa?
>> > > >> projectId=12316020&version=12340498
>> > > >>
>> > > >>
>> > > >> Release note highlights can be found here:
>> > > >>
>> > > >> https://cwiki.apache.org/confluence/display/NIFI/
>> > > >> Release+Notes#ReleaseNotes-Version1.3.0
>> > > >>
>> > > >>
>> > > >> The vote will be open for 72 hours.
>> > > >>
>> > > >> Please download the release candidate and evaluate the necessary
>> items
>> > > >> including checking hashes, signatures, build from source, and test.
>> > The
>> > > >> please vote:
>> > > >>
>> > > >>
>> > > >> [ ] +1 Release this package as nifi-1.3.0
>> > > >>
>> > > >> [ ] +0 no opinion
>> > > >>
>> > > >> [ ] -1 Do not release this package because...
>> > > >>
>> > >
>> >
>>
>>
>>
>> --
>> --
>> [hidden email]
>> @YolandaMDavis
>>
Reply | Threaded
Open this post in threaded view
|

Re: [VOTE] Release Apache NiFi 1.3.0

Aldrin Piri
+1, binding

Hashes and signature looks good
Build and contrib check was clean
README, L&N look good
Verified some simple flows


Environment:
Apache Maven 3.3.1 (cab6659f9874fa96462afef40fcf6bc033d58c1c;
2015-03-13T16:10:27-04:00)
Maven home: /usr/local/maven
Java version: 1.8.0_121, vendor: Oracle Corporation
Java home: /usr/lib/jvm/java-1.8.0-openjdk-1.8.0.121-0.b13.el7_3.x86_64/jre
Default locale: en_US, platform encoding: UTF-8
OS name: "linux", version: "3.18.17-13.el7.x86_64", arch: "amd64", family:
"unix"
CentOS Linux release 7.3.1611 (Core)

On Tue, Jun 6, 2017 at 9:37 PM, Koji Kawamura <[hidden email]>
wrote:

> +1 (binding)
>
> - ran through release helper
> - ran clean build, test passed without issue
> - ran simple flow using standalone/non-secure/secure/clustered NiFi
> - confirmed few JIRAs data flow those had been addressed within 1.3.0
>
>
> On Wed, Jun 7, 2017 at 2:15 AM, Pierre Villard
> <[hidden email]> wrote:
> > +1 (binding)
> >
> > - verified signatures, checksums, license, notice and readme.
> > - full build on OSX, Windows 10, CentOS 7 (faced some test errors while
> > building on Windows but the failing tests have already opened JIRAs to
> > track them)
> > - checked UIs changes
> > - tested some workflows for Record based processors and SiteToSite
> > reporting tasks
> >
> > Release this package as nifi-1.3.0
> >
> >
> > 2017-06-06 18:55 GMT+02:00 Yolanda Davis <[hidden email]>:
> >
> >> +1 (binding)
> >>
> >> -ran through release helper, verified hashes, signatures, checked
> README,
> >> LICENSE, NOTICE
> >> -ran build and tested with flows using QueryRecord
> (RecordReaders/Writers
> >> etc), worked as expected.
> >>
> >> On Tue, Jun 6, 2017 at 12:44 PM, Joe Skora <[hidden email]> wrote:
> >>
> >> > +1 (binding)
> >> >
> >> > * Verified GPG signature.
> >> > * Verified hashes.
> >> > * Built source with contrib-check profile.
> >> > * Verified README, NOTICE, and LICENSE.
> >> > * Verified commit ID.
> >> > * Verified RC was branched from master.
> >> > * Ran binary and tested basic functionality.
> >> >
> >> >
> >> > On Tue, Jun 6, 2017 at 10:27 AM, Bryan Bende <[hidden email]>
> wrote:
> >> >
> >> > > +1 (binding) Release this package as nifi-1.3.0
> >> > >
> >> > > - Ran through release helper and everything checked out
> >> > > - Ran some test flows with HDFS processors and verified they worked
> >> > > correctly
> >> > >
> >> > > On Tue, Jun 6, 2017 at 12:42 AM, James Wing <[hidden email]>
> wrote:
> >> > > > +1 (binding).  I ran through the release helper -- verified
> signature
> >> > and
> >> > > > hashes, ran the full build, checked readme, license, and notice in
> >> > source
> >> > > > and output.  I ran a simple flow and verified that it still works.
> >> > > >
> >> > > > Thanks for putting this release together, Matt.
> >> > > >
> >> > > > James
> >> > > >
> >> > > >
> >> > > > On Mon, Jun 5, 2017 at 10:54 AM, Matt Gilman <[hidden email]
> >
> >> > > wrote:
> >> > > >
> >> > > >> Hello,
> >> > > >>
> >> > > >>
> >> > > >> I am pleased to be calling this vote for the source release of
> >> Apache
> >> > > NiFi
> >> > > >> nifi-1.3.0.
> >> > > >>
> >> > > >>
> >> > > >> The source zip, including signatures, digests, etc. can be found
> at:
> >> > > >>
> >> > > >> https://repository.apache.org/content/repositories/
> >> orgapachenifi-1108
> >> > > >>
> >> > > >>
> >> > > >> The Git tag is nifi-1.3.0-RC1
> >> > > >>
> >> > > >> The Git commit ID is ddb73612bd1512d8b2151b81f9aa40811bca2aaa
> >> > > >>
> >> > > >> https://git-wip-us.apache.org/repos/asf?p=nifi.git;a=commit;h=
> >> > > >> ddb73612bd1512d8b2151b81f9aa40811bca2aaa
> >> > > >>
> >> > > >>
> >> > > >> Checksums of nifi-1.3.0-source-release.zip:
> >> > > >>
> >> > > >> MD5: 8b115682ac392342b9edff3bf0658ecb
> >> > > >>
> >> > > >> SHA1: f11cdebbabdc0d8f1f0dd4c5b880ded39d17f234
> >> > > >>
> >> > > >> SHA256: 9ba5565729d98c472c31a1fdbc44e9
> >> dc1eee87a2cf5184e8428743f75314
> >> > > 5b7f
> >> > > >>
> >> > > >>
> >> > > >> Release artifacts are signed with the following key:
> >> > > >>
> >> > > >> https://people.apache.org/keys/committer/mcgilman.asc
> >> > > >>
> >> > > >>
> >> > > >> KEYS file available here:
> >> > > >>
> >> > > >> https://dist.apache.org/repos/dist/release/nifi/KEYS
> >> > > >>
> >> > > >>
> >> > > >> 110 issues were closed/resolved for this release:
> >> > > >>
> >> > > >> https://issues.apache.org/jira/secure/ReleaseNote.jspa?
> >> > > >> projectId=12316020&version=12340498
> >> > > >>
> >> > > >>
> >> > > >> Release note highlights can be found here:
> >> > > >>
> >> > > >> https://cwiki.apache.org/confluence/display/NIFI/
> >> > > >> Release+Notes#ReleaseNotes-Version1.3.0
> >> > > >>
> >> > > >>
> >> > > >> The vote will be open for 72 hours.
> >> > > >>
> >> > > >> Please download the release candidate and evaluate the necessary
> >> items
> >> > > >> including checking hashes, signatures, build from source, and
> test.
> >> > The
> >> > > >> please vote:
> >> > > >>
> >> > > >>
> >> > > >> [ ] +1 Release this package as nifi-1.3.0
> >> > > >>
> >> > > >> [ ] +0 no opinion
> >> > > >>
> >> > > >> [ ] -1 Do not release this package because...
> >> > > >>
> >> > >
> >> >
> >>
> >>
> >>
> >> --
> >> --
> >> [hidden email]
> >> @YolandaMDavis
> >>
>
12